Details

    • Type: Bug Bug
    • Status: Closed Closed
    • Priority: Major Major
    • Resolution: Fixed
    • Affects Version/s: None
    • Fix Version/s: 2.4
    • Labels:
      None
    • Environment:
      Windows 2000
    • Number of attachments :
      4

      Description

      Ladies and gentlemen

      the BUILD FAILS in the pdf:pdf goal.

      with the message:

      java.lang.NoSuchMethodError: org.apache.batik.bridge.UnitProcessor.createContext(Lorg/apache/batik/bridge/BridgeContext;Lorg/w3c/dom/Element;)Lorg/apache/batik/util/UnitProcessor$Context;

      I am using Maven 1.0.2 and want to include an SVG - graphic.

      Thanks for any advice - until this problem can be solved.

      My regards,

      Valerie Nyre

      The complete debugging output is as follows:

      J:\MAAS\02WORK\02MAAS_WORK_MAVEN\NYRE_WORK>E:\Programme\maven-1.0.2\bin\maven -X -Dmaven.home.local=I:\MAVENLOCALREPO\.maven -dI:\MAVENLOCALREPO\maasintern\NYRETEST pdf
      __ __

      \/ __ Apache_ ___
        \/ / ` \ V / -) ' \ ~ intelligent projects ~
      _   _,_ _/___ _ _ v. 1.0.2

      Initializing Plugins!
      Set plugin source directory to E:\Programme\maven-1.0.2\plugins
      Set unpacked plugin directory to I:\MAVENLOCALREPO\.maven\cache
      Set user plugin directory to I:\MAVENLOCALREPO\.maven\plugins
      Loading plugin cache
      Now mapping cached plugins
      Loading plugin 'maven-cruisecontrol-plugin-1.6'
      Loading plugin 'maven-multichanges-plugin-1.1'
      Loading plugin 'maven-checkstyle-plugin-2.5'
      Loading plugin 'maven-file-activity-plugin-1.5.1'
      Loading plugin 'maven-jellydoc-plugin-1.3.1'
      Loading plugin 'maven-ear-plugin-1.6'
      Loading plugin 'maven-jdepend-plugin-1.5'
      Loading plugin 'maven-pom-plugin-1.4.1'
      Loading plugin 'maven-jira-plugin-1.1.2'
      Loading plugin 'maven-jar-plugin-1.6.1'
      Loading plugin 'maven-developer-activity-plugin-1.5.1'
      Loading plugin 'maven-jboss-plugin-1.5'
      Loading plugin 'maven-faq-plugin-1.4'
      Loading plugin 'maven-dist-plugin-1.6.1'
      Loading plugin 'maven-javadoc-plugin-1.7'
      Loading plugin 'maven-linkcheck-plugin-1.3.4'
      Loading plugin 'maven-tasklist-plugin-2.3'
      Loading plugin 'maven-idea-plugin-1.5'
      Loading plugin 'maven-jcoverage-plugin-1.0.9'
      Loading plugin 'maven-junit-report-plugin-1.5'
      Loading plugin 'maven-plugin-plugin-1.5.2'
      Loading plugin 'maven-changelog-plugin-1.7.1'
      Loading plugin 'maven-jxr-plugin-1.4.2'
      Loading plugin 'maven-ashkelon-plugin-1.2'
      Loading plugin 'maven-announcement-plugin-1.3'
      Loading plugin 'maven-xdoc-plugin-1.8'
      Loading plugin 'maven-eclipse-plugin-1.9'
      Loading plugin 'maven-shell-plugin-1.1'
      Loading plugin 'maven-rar-plugin-1.0'
      Loading plugin 'maven-dashboard-plugin-1.6'
      Loading plugin 'maven-scm-plugin-1.4.1'
      Loading plugin 'maven-clover-plugin-1.6'
      Loading plugin 'maven-uberjar-plugin-1.2'
      Loading plugin 'maven-war-plugin-1.6.1'
      Loading plugin 'maven-ant-plugin-1.8.1'
      Loading plugin 'maven-simian-plugin-1.4'
      Loading plugin 'maven-tjdo-plugin-1.0.0'
      Loading plugin 'maven-ejb-plugin-1.5'
      Loading plugin 'maven-changes-plugin-1.5.1'
      Loading plugin 'maven-j2ee-plugin-1.5.1'
      Loading plugin 'maven-release-plugin-1.4.1'
      Loading plugin 'maven-abbot-plugin-1.1'
      Loading plugin 'maven-nsis-plugin-1.1'
      Loading plugin 'maven-multiproject-plugin-1.3.1'
      Loading plugin 'maven-license-plugin-1.2'
      Loading plugin 'maven-jdiff-plugin-1.4'
      Loading plugin 'maven-pmd-plugin-1.6'
      Loading plugin 'maven-repository-plugin-1.2'
      Loading plugin 'maven-jbuilder-plugin-1.5'
      Loading plugin 'maven-console-plugin-1.1'
      Loading plugin 'maven-webserver-plugin-2.0'
      Loading plugin 'maven-aspectwerkz-plugin-1.2'
      Loading plugin 'maven-test-plugin-1.6.2'
      Loading plugin 'maven-jetty-plugin-1.1'
      Loading plugin 'maven-docbook-plugin-1.2'
      Loading plugin 'maven-latka-plugin-1.4.1'
      Loading plugin 'maven-aspectj-plugin-3.2'
      Loading plugin 'maven-hibernate-plugin-1.2'
      Loading plugin 'maven-native-plugin-1.1'
      Loading plugin 'maven-site-plugin-1.5.2'
      Loading plugin 'maven-gump-plugin-1.4'
      Loading plugin 'maven-appserver-plugin-2.0'
      Loading plugin 'maven-java-plugin-1.5'
      Loading plugin 'maven-pdf-plugin-2.2.1'
      Loading plugin 'maven-html2xdoc-plugin-1.3.1'
      Loading plugin 'maven-jdee-plugin-1.1'
      Loading plugin 'maven-jalopy-plugin-1.3.1'
      Loading plugin 'maven-jnlp-plugin-1.4.1'
      Loading plugin 'maven-jdeveloper-plugin-1.4'
      Loading plugin 'maven-junit-doclet-plugin-1.2'
      Loading plugin 'maven-wizard-plugin-1.1'
      Loading plugin 'maven-artifact-plugin-1.4.1'
      Loading plugin 'maven-javacc-plugin-1.1'
      Loading plugin 'maven-antlr-plugin-1.2.1'
      Loading plugin 'maven-struts-plugin-1.3'
      Loading plugin 'maven-clean-plugin-1.3'
      Loading plugin 'maven-castor-plugin-1.2'
      Loading plugin 'maven-latex-plugin-1.4.1'
      Loading plugin 'maven-genapp-plugin-2.2'
      Loading plugin 'maven-caller-plugin-1.1'
      Loading plugin 'maven-vdoclet-plugin-1.2'
      Now loading uncached plugins
      Finished initializing Plugins!
      Using userBuildPropertiesFile: C:\Dokumente und Einstellungen\Administrator\build.properties
      Using projectPropertiesFile: I:\MAVENLOCALREPO\maasintern\NYRETEST\project.properties
      Using projectBuildPropertiesFile: I:\MAVENLOCALREPO\maasintern\NYRETEST\build.properties
      pushing on org.apache.maven.jelly.MavenJellyContext@42552c over org.apache.maven.jelly.MavenJellyContext@e5bbd6 in nyregroup:nyretest
      [DEBUG] Adding reference: maven.dependency.classpath ->
      running script null
      [available] [VERBOSE] Found: src\java
      [available] [VERBOSE] Found: src\test
      [DEBUG] Adding reference: maven-classpath ->
      [DEBUG] Adding reference: maven.compile.src.set ->
      [DEBUG] Adding reference: maven.test.compile.src.set ->
      Verifying dependencies for nyregroup:nyretest
      Processing dependencies for project Name of the Project; classloader [ForeheadClassLoader: name="root.maven"]
      preparing goal: build:start
      execution chain: [[Goal: name="build:start"]; precursor=[]]]
      final list of plugins to prepare: []
      preparing goal: pdf
      execution chain: [[Goal: name="xdoc:init"]; precursor=[]], [Goal: name="pdf:init"]; precursor=[[Goal: name="xdoc:init"]; precursor=[]]]], [Goal: name="pdf:pdf"]; precursor=[[Goal: name="pdf:prepare"]; precursor=[[Goal: name="pdf:init"]; precursor=[[Goal: name="xdoc:init"]; precursor=[]]]]]]]], [Goal: name="pdf:prepare"]; precursor=[[Goal: name="pdf:init"]; precursor=[[Goal: name="xdoc:init"]; precursor=[]]]]]], [Goal: name="fo:fo"]; precursor=[[Goal: name="pdf:prepare"]; precursor=[[Goal: name="pdf:init"]; precursor=[[Goal: name="xdoc:init"]; precursor=[]]]]]]]], [Goal: name="pdf"]; precursor=[[Goal: name="fo:fo"]; precursor=[[Goal: name="pdf:prepare"]; precursor=[[Goal: name="pdf:init"]; precursor=[[Goal: name="xdoc:init"]; precursor=[]]]]]]]], [Goal: name="pdf:prepare"]; precursor=[[Goal: name="pdf:init"]; precursor=[[Goal: name="xdoc:init"]; precursor=[]]]]]], [Goal: name="pdf:pdf"]; precursor=[[Goal: name="pdf:prepare"]; precursor=[[Goal: name="pdf:init"]; precursor=[[Goal: name="xdoc:init"]; precursor=[]]]]]]]]]]]
      goal xdoc:init has preGoal decorators [
      source = I:\MAVENLOCALREPO\.maven\cache\maven-html2xdoc-plugin-1.3.1\plugin.jelly
      project = null
      script = null]
      dynatag dependencies: [
      source = I:\MAVENLOCALREPO\.maven\cache\maven-pom-plugin-1.4.1\plugin.jelly
      project = null
      script = null,
      source = I:\MAVENLOCALREPO\.maven\cache\maven-artifact-plugin-1.4.1\plugin.jelly
      project = null
      script = null]
      final list of plugins to prepare: [
      source = I:\MAVENLOCALREPO\.maven\cache\maven-pom-plugin-1.4.1\plugin.jelly
      project = null
      script = null,
      source = I:\MAVENLOCALREPO\.maven\cache\maven-artifact-plugin-1.4.1\plugin.jelly
      project = null
      script = null,
      source = I:\MAVENLOCALREPO\.maven\cache\maven-xdoc-plugin-1.8\plugin.jelly
      project = null
      script = null,
      source = I:\MAVENLOCALREPO\.maven\cache\maven-html2xdoc-plugin-1.3.1\plugin.jelly
      project = null
      script = null,
      source = I:\MAVENLOCALREPO\.maven\cache\maven-pdf-plugin-2.2.1\plugin.jelly
      project = null
      script = null]
      Using userBuildPropertiesFile: C:\Dokumente und Einstellungen\Administrator\build.properties
      Using projectPropertiesFile: I:\MAVENLOCALREPO\.maven\cache\maven-pom-plugin-1.4.1\project.properties
      Using projectBuildPropertiesFile: I:\MAVENLOCALREPO\.maven\cache\maven-pom-plugin-1.4.1\build.properties
      pushing on org.apache.maven.jelly.MavenJellyContext@149eb9f over org.apache.maven.jelly.MavenJellyContext@c3014 in maven-pom-plugin:maven-pom-plugin
      initialising plugin housing: Maven POM Plugin
      running script I:\MAVENLOCALREPO\.maven\cache\maven-pom-plugin-1.4.1\plugin.jelly
      Verifying dependencies for maven-pom-plugin:maven-pom-plugin
      Processing dependencies for project Maven POM Plugin; classloader [ForeheadClassLoader: name="root.maven"]
      adding dependency I:\MAVENLOCALREPO\.maven\repository\dom4j\jars\dom4j-1.4-dev-8.jar into project classloader
      adding dependency I:\MAVENLOCALREPO\.maven\repository\xml-apis\jars\xml-apis-1.0.b2.jar into project classloader
      adding dependency E:\Programme\maven-1.0.2\lib\maven.jar into project classloader
      adding dependency I:\MAVENLOCALREPO\.maven\repository\isorelax\jars\isorelax-20030108.jar into project classloader
      adding dependency I:\MAVENLOCALREPO\.maven\repository\thaiopensource\jars\jing-20030619.jar into project classloader
      adding dependency I:\MAVENLOCALREPO\.maven\repository\xerces\jars\xerces-2.4.0.jar into project classloader
      Using userBuildPropertiesFile: C:\Dokumente und Einstellungen\Administrator\build.properties
      Using projectPropertiesFile: I:\MAVENLOCALREPO\.maven\cache\maven-artifact-plugin-1.4.1\project.properties
      Using projectBuildPropertiesFile: I:\MAVENLOCALREPO\.maven\cache\maven-artifact-plugin-1.4.1\build.properties
      pushing on org.apache.maven.jelly.MavenJellyContext@61a907 over org.apache.maven.jelly.MavenJellyContext@1a0225b in maven-artifact-plugin:maven-artifact-plugin
      initialising plugin housing: Maven Artifact Plugin
      running script I:\MAVENLOCALREPO\.maven\cache\maven-artifact-plugin-1.4.1\plugin.jelly
      Verifying dependencies for maven-artifact-plugin:maven-artifact-plugin
      Processing dependencies for project Maven Artifact Plugin; classloader [ForeheadClassLoader: name="root.maven"]
      adding dependency E:\Programme\maven-1.0.2\lib\maven.jar into project classloader
      adding dependency I:\MAVENLOCALREPO\.maven\repository\commons-io\jars\commons-io-20030203.000550.jar into project classloader
      adding dependency I:\MAVENLOCALREPO\.maven\repository\commons-net\jars\commons-net-1.1.0.jar into project classloader
      adding dependency I:\MAVENLOCALREPO\.maven\repository\commons-httpclient\jars\commons-httpclient-2.0.jar into project classloader
      adding dependency I:\MAVENLOCALREPO\.maven\repository\commons-lang\jars\commons-lang-2.0.jar into project classloader
      adding dependency I:\MAVENLOCALREPO\.maven\repository\commons-logging\jars\commons-logging-1.0.3.jar into project classloader
      adding dependency I:\MAVENLOCALREPO\.maven\repository\jsch\jars\jsch-0.1.5.jar into project classloader
      adding dependency I:\MAVENLOCALREPO\.maven\repository\commons-jelly\jars\commons-jelly-20030902.160215.jar into project classloader
      adding dependency I:\MAVENLOCALREPO\.maven\repository\commons-jelly\jars\commons-jelly-tags-velocity-20030303.205659.jar into project classloader
      adding dependency I:\MAVENLOCALREPO\.maven\repository\velocity\jars\velocity-1.4-dev.jar into project classloader
      Using userBuildPropertiesFile: C:\Dokumente und Einstellungen\Administrator\build.properties
      Using projectPropertiesFile: I:\MAVENLOCALREPO\.maven\cache\maven-xdoc-plugin-1.8\project.properties
      Using projectBuildPropertiesFile: I:\MAVENLOCALREPO\.maven\cache\maven-xdoc-plugin-1.8\build.properties
      pushing on org.apache.maven.jelly.MavenJellyContext@1722456 over org.apache.maven.jelly.MavenJellyContext@afa68a in maven-xdoc-plugin:maven-xdoc-plugin
      initialising plugin housing: Maven XDoc Plug-in
      running script I:\MAVENLOCALREPO\.maven\cache\maven-xdoc-plugin-1.8\plugin.jelly
      Verifying dependencies for maven-xdoc-plugin:maven-xdoc-plugin
      Processing dependencies for project Maven XDoc Plug-in; classloader [ForeheadClassLoader: name="root.maven"]
      adding dependency I:\MAVENLOCALREPO\.maven\repository\dom4j\jars\dom4j-1.4-dev-8.jar into project classloader
      adding dependency I:\MAVENLOCALREPO\.maven\repository\commons-jelly\jars\commons-jelly-20030902.160215.jar into project classloader
      adding dependency I:\MAVENLOCALREPO\.maven\repository\commons-jelly\jars\commons-jelly-tags-jsl-20030211.143151.jar into project classloader
      adding dependency I:\MAVENLOCALREPO\.maven\repository\commons-jelly\jars\commons-jelly-tags-log-20030211.142821.jar into project classloader
      adding dependency I:\MAVENLOCALREPO\.maven\repository\commons-jelly\jars\commons-jelly-tags-velocity-20030303.205659.jar into project classloader
      adding dependency I:\MAVENLOCALREPO\.maven\repository\commons-jelly\jars\commons-jelly-tags-xml-20040613.030723.jar into project classloader
      adding dependency I:\MAVENLOCALREPO\.maven\repository\commons-logging\jars\commons-logging-1.0.3.jar into project classloader
      adding dependency E:\Programme\maven-1.0.2\lib\maven.jar into project classloader
      adding dependency I:\MAVENLOCALREPO\.maven\repository\velocity\jars\velocity-1.4-dev.jar into project classloader
      adding dependency I:\MAVENLOCALREPO\.maven\repository\velocity-dvsl\jars\velocity-dvsl-0.45.jar into project classloader
      adding dependency I:\MAVENLOCALREPO\.maven\repository\xml-apis\jars\xml-apis-1.0.b2.jar into project classloader
      Using userBuildPropertiesFile: C:\Dokumente und Einstellungen\Administrator\build.properties
      Using projectPropertiesFile: I:\MAVENLOCALREPO\.maven\cache\maven-html2xdoc-plugin-1.3.1\project.properties
      Using projectBuildPropertiesFile: I:\MAVENLOCALREPO\.maven\cache\maven-html2xdoc-plugin-1.3.1\build.properties
      pushing on org.apache.maven.jelly.MavenJellyContext@aae86e over org.apache.maven.jelly.MavenJellyContext@81a197 in maven-html2xdoc-plugin:maven-html2xdoc-plugin
      initialising plugin housing: Maven Html2XDoc Plug-in
      running script I:\MAVENLOCALREPO\.maven\cache\maven-html2xdoc-plugin-1.3.1\plugin.jelly
      Verifying dependencies for maven-html2xdoc-plugin:maven-html2xdoc-plugin
      Processing dependencies for project Maven Html2XDoc Plug-in; classloader [ForeheadClassLoader: name="root.maven"]
      adding dependency I:\MAVENLOCALREPO\.maven\repository\commons-jelly\jars\commons-jelly-tags-xml-20040613.030723.jar into project classloader
      adding dependency I:\MAVENLOCALREPO\.maven\repository\commons-jelly\jars\commons-jelly-tags-html-20030317.100924.jar into project classloader
      adding dependency I:\MAVENLOCALREPO\.maven\repository\nekohtml\jars\nekohtml-0.7.7.jar into project classloader
      adding dependency I:\MAVENLOCALREPO\.maven\repository\commons-logging\jars\commons-logging-1.0.3.jar into project classloader
      adding dependency I:\MAVENLOCALREPO\.maven\repository\dom4j\jars\dom4j-1.4-dev-8.jar into project classloader
      adding dependency I:\MAVENLOCALREPO\.maven\repository\xml-apis\jars\xml-apis-1.0.b2.jar into project classloader
      adding dependency I:\MAVENLOCALREPO\.maven\repository\xerces\jars\xerces-2.4.0.jar into project classloader
      Using userBuildPropertiesFile: C:\Dokumente und Einstellungen\Administrator\build.properties
      Using projectPropertiesFile: I:\MAVENLOCALREPO\.maven\cache\maven-pdf-plugin-2.2.1\project.properties
      Using projectBuildPropertiesFile: I:\MAVENLOCALREPO\.maven\cache\maven-pdf-plugin-2.2.1\build.properties
      pushing on org.apache.maven.jelly.MavenJellyContext@19cd75a over org.apache.maven.jelly.MavenJellyContext@1fe8ce8 in maven-pdf-plugin:maven-pdf-plugin
      initialising plugin housing: Maven PDF Plug-in
      running script I:\MAVENLOCALREPO\.maven\cache\maven-pdf-plugin-2.2.1\plugin.jelly
      Verifying dependencies for maven-pdf-plugin:maven-pdf-plugin
      Processing dependencies for project Maven PDF Plug-in; classloader [ForeheadClassLoader: name="root.maven"]
      adding dependency I:\MAVENLOCALREPO\.maven\repository\fop\jars\fop-0.20.5.jar into project classloader
      adding dependency I:\MAVENLOCALREPO\.maven\repository\batik\jars\batik-1.5.jar into project classloader
      adding dependency I:\MAVENLOCALREPO\.maven\repository\batik\jars\batik-awt-util-1.5.jar into project classloader
      adding dependency I:\MAVENLOCALREPO\.maven\repository\batik\jars\batik-bridge-1.5.jar into project classloader
      adding dependency I:\MAVENLOCALREPO\.maven\repository\batik\jars\batik-css-1.5.jar into project classloader
      adding dependency I:\MAVENLOCALREPO\.maven\repository\batik\jars\batik-dom-1.5.jar into project classloader
      adding dependency I:\MAVENLOCALREPO\.maven\repository\batik\jars\batik-ext-1.5.jar into project classloader
      adding dependency I:\MAVENLOCALREPO\.maven\repository\batik\jars\batik-extension-1.5.jar into project classloader
      adding dependency I:\MAVENLOCALREPO\.maven\repository\batik\jars\batik-gui-util-1.5.jar into project classloader
      adding dependency I:\MAVENLOCALREPO\.maven\repository\batik\jars\batik-gvt-1.5.jar into project classloader
      adding dependency I:\MAVENLOCALREPO\.maven\repository\batik\jars\batik-parser-1.5.jar into project classloader
      adding dependency I:\MAVENLOCALREPO\.maven\repository\batik\jars\batik-rasterizer-1.5.jar into project classloader
      adding dependency I:\MAVENLOCALREPO\.maven\repository\batik\jars\batik-script-1.5.jar into project classloader
      adding dependency I:\MAVENLOCALREPO\.maven\repository\batik\jars\batik-svg-dom-1.5.jar into project classloader
      adding dependency I:\MAVENLOCALREPO\.maven\repository\batik\jars\batik-svggen-1.5.jar into project classloader
      adding dependency I:\MAVENLOCALREPO\.maven\repository\batik\jars\batik-swing-1.5.jar into project classloader
      adding dependency I:\MAVENLOCALREPO\.maven\repository\batik\jars\batik-transcoder-1.5.jar into project classloader
      adding dependency I:\MAVENLOCALREPO\.maven\repository\batik\jars\batik-util-1.5.jar into project classloader
      adding dependency I:\MAVENLOCALREPO\.maven\repository\batik\jars\batik-xml-1.5.jar into project classloader
      adding dependency I:\MAVENLOCALREPO\.maven\repository\logkit\jars\logkit-1.2.2.jar into project classloader
      adding dependency I:\MAVENLOCALREPO\.maven\repository\avalon-framework\jars\avalon-framework-4.1.5.jar into project classloader
      DEPRECATION: xerces:xerces in project maven-pdf-plugin:maven-pdf-plugin forces the classloader 'root'
      This behaviour is deprecated. Please refer to the FAQ
      poking dependency I:\MAVENLOCALREPO\.maven\repository\xerces\jars\xerces-2.4.0.jar into classloader root
      DEPRECATION: xml-apis:xml-apis in project maven-pdf-plugin:maven-pdf-plugin forces the classloader 'root'
      This behaviour is deprecated. Please refer to the FAQ
      poking dependency I:\MAVENLOCALREPO\.maven\repository\xml-apis\jars\xml-apis-1.0.b2.jar into classloader root
      DEPRECATION: xalan:xalan in project maven-pdf-plugin:maven-pdf-plugin forces the classloader 'root'
      This behaviour is deprecated. Please refer to the FAQ
      poking dependency I:\MAVENLOCALREPO\.maven\repository\xalan\jars\xalan-2.4.1.jar into classloader root
      preparing goal: build:end
      execution chain: [[Goal: name="build:end"]; precursor=[]]]
      final list of plugins to prepare: []
      attaining goal build:start
      attaining goal pdf
      Plugin context for maven-xdoc-plugin already initialised for this base context
      Plugin context for maven-xdoc-plugin already initialised for this base context
      Plugin context for maven-xdoc-plugin already initialised for this base context
      Plugin context for maven-xdoc-plugin already initialised for this base context
      Plugin context for maven-xdoc-plugin already initialised for this base context
      build:start:

      xdoc:init:

      pdf:init:
      [echo]

          1. Debug mode is on ###
            ==============================
            === xdoc plugin properties ===
            ==============================
            maven.docs.src = [I:\MAVENLOCALREPO\maasintern\NYRETEST/xdocs]
            maven.docs.dest = [I:\MAVENLOCALREPO\maasintern\NYRETEST/target/docs]
            maven.gen.docs = [I:\MAVENLOCALREPO\maasintern\NYRETEST/target/generated-xdocs]
            maven.xdoc.date.format = [dd MMMM yyyy]
            maven.xdoc.date.locale = [en]
            ==============================
            === pdf plugin properties ===
            ==============================
            maven.pdf.confidential = [false]
            maven.pdf.paperType = [A4]
            maven.pdf.companyIncName = [Maas High Tech Software GmbH]
            maven.pdf.copyrightYear = [2005]
            maven.pdf.imageDpi = [72]
            maven.pdf.debug = [true]
            maven.pdf.navigationFile = [navigation.xml]
            maven.pdf.navigationFilePath = [I:\MAVENLOCALREPO\maasintern\NYRETEST/xdocs]
            maven.pdf.pdfName = [nyretest.pdf]
            maven.pdf.cover.projectCompany = [Maas High Tech Software GmbH]
            maven.pdf.cover.projectName = [Name of the Project]
            maven.pdf.cover.type = [Project Documentation]
            maven.pdf.cover.version = [1.0]
            maven.pdf.cover.date = [25 February 2005]
            maven.pdf.projectLogo = [../images/maas/ProductLogo.jpg]
            maven.pdf.companyLogo = [../images/maas/logo_maas_www.svg]

      maven.pdf.companySplashImage = [../images/maas/maas_looperman.jpg]

      ==============================
      === pdf internal variables ===
      ==============================
      internal_pdf_workingDir = [I:\MAVENLOCALREPO\maasintern\NYRETEST/target/pdf]

      pdf:prepare:
      [copy] [DEBUG] fileset: Setup scanner in dir I:\MAVENLOCALREPO\maasintern\NYRETEST\target\generated-xdocs with patternSet

      { includes: [**/*.*] excludes: [] }

      [copy] [VERBOSE] cvs-usage.xml omitted as cvs-usage.xml is up to date.
      [copy] [VERBOSE] dependencies.xml omitted as dependencies.xml is up to date.
      [copy] [VERBOSE] downloads.xml omitted as downloads.xml is up to date.
      [copy] [VERBOSE] index.xml omitted as index.xml is up to date.
      [copy] [VERBOSE] issue-tracking.xml omitted as issue-tracking.xml is up to date.
      [copy] [VERBOSE] mail-lists.xml omitted as mail-lists.xml is up to date.
      [copy] [VERBOSE] maven-reports.xml omitted as maven-reports.xml is up to date.
      [copy] [VERBOSE] project-info.xml omitted as project-info.xml is up to date.
      [copy] [VERBOSE] team-list.xml omitted as team-list.xml is up to date.
      [copy] [DEBUG] fileset: Setup scanner in dir I:\MAVENLOCALREPO\maasintern\NYRETEST\xdocs with patternSet

      { includes: [**/*.*] excludes: [] }

      [copy] Copying 26 files to I:\MAVENLOCALREPO\maasintern\NYRETEST\target\pdf
      [copy] [VERBOSE] Copying I:\MAVENLOCALREPO\maasintern\NYRETEST\xdocs\103_Dokumentation_Sourcecode_Listings\index.xml to I:\MAVENLOCALREPO\maasintern\NYRETEST\target\pdf\103_Dokumentation_Sourcecode_Listings\index.xml
      [copy] [VERBOSE] Copying I:\MAVENLOCALREPO\maasintern\NYRETEST\xdocs\900_Dokumentation_andere Verfahren\index.xml to I:\MAVENLOCALREPO\maasintern\NYRETEST\target\pdf\900_Dokumentation_andere Verfahren\index.xml
      [copy] [VERBOSE] Copying I:\MAVENLOCALREPO\maasintern\NYRETEST\xdocs\index.xml to I:\MAVENLOCALREPO\maasintern\NYRETEST\target\pdf\index.xml
      [copy] [VERBOSE] Copying I:\MAVENLOCALREPO\maasintern\NYRETEST\xdocs\104_Dokumentation_Index_Navigation\index.xml.bak to I:\MAVENLOCALREPO\maasintern\NYRETEST\target\pdf\104_Dokumentation_Index_Navigation\index.xml.bak
      [copy] [VERBOSE] Copying I:\MAVENLOCALREPO\maasintern\NYRETEST\xdocs\105_Dokumentation_xdocs allgemein\index.xml.bak to I:\MAVENLOCALREPO\maasintern\NYRETEST\target\pdf\105_Dokumentation_xdocs allgemein\index.xml.bak
      [copy] [VERBOSE] Copying I:\MAVENLOCALREPO\maasintern\NYRETEST\xdocs\105_Dokumentation_xdocs allgemein\index.xml to I:\MAVENLOCALREPO\maasintern\NYRETEST\target\pdf\105_Dokumentation_xdocs allgemein\index.xml
      [copy] [VERBOSE] Copying I:\MAVENLOCALREPO\maasintern\NYRETEST\xdocs\stylesheets\maven-base.css to I:\MAVENLOCALREPO\maasintern\NYRETEST\target\pdf\stylesheets\maven-base.css
      [copy] [VERBOSE] Copying I:\MAVENLOCALREPO\maasintern\NYRETEST\xdocs\103_Dokumentation_Sourcecode_Listings\index.xml.bak to I:\MAVENLOCALREPO\maasintern\NYRETEST\target\pdf\103_Dokumentation_Sourcecode_Listings\index.xml.bak
      [copy] [VERBOSE] Copying I:\MAVENLOCALREPO\maasintern\NYRETEST\xdocs\images\maas\ProductLogo.jpg to I:\MAVENLOCALREPO\maasintern\NYRETEST\target\pdf\images\maas\ProductLogo.jpg
      [copy] [VERBOSE] Copying I:\MAVENLOCALREPO\maasintern\NYRETEST\xdocs\001_ContentManagement\index.xml to I:\MAVENLOCALREPO\maasintern\NYRETEST\target\pdf\001_ContentManagement\index.xml
      [copy] [VERBOSE] Copying I:\MAVENLOCALREPO\maasintern\NYRETEST\xdocs\stylesheets\maven-classic.css to I:\MAVENLOCALREPO\maasintern\NYRETEST\target\pdf\stylesheets\maven-classic.css
      [copy] [VERBOSE] Copying I:\MAVENLOCALREPO\maasintern\NYRETEST\xdocs\104_Dokumentation_Index_Navigation\index.xml to I:\MAVENLOCALREPO\maasintern\NYRETEST\target\pdf\104_Dokumentation_Index_Navigation\index.xml
      [copy] [VERBOSE] Copying I:\MAVENLOCALREPO\maasintern\NYRETEST\xdocs\106_Dokumentation_andere Formate\index.xml to I:\MAVENLOCALREPO\maasintern\NYRETEST\target\pdf\106_Dokumentation_andere Formate\index.xml
      [copy] [VERBOSE] Copying I:\MAVENLOCALREPO\maasintern\NYRETEST\xdocs\106_Dokumentation_andere Formate\index.xml.bak to I:\MAVENLOCALREPO\maasintern\NYRETEST\target\pdf\106_Dokumentation_andere Formate\index.xml.bak
      [copy] [VERBOSE] Copying I:\MAVENLOCALREPO\maasintern\NYRETEST\xdocs\102_Dokumentation_Maven Reports\index.xml.bak to I:\MAVENLOCALREPO\maasintern\NYRETEST\target\pdf\102_Dokumentation_Maven Reports\index.xml.bak
      [copy] [VERBOSE] Copying I:\MAVENLOCALREPO\maasintern\NYRETEST\xdocs\900_Dokumentation_andere Verfahren\index.xml.bak to I:\MAVENLOCALREPO\maasintern\NYRETEST\target\pdf\900_Dokumentation_andere Verfahren\index.xml.bak
      [copy] [VERBOSE] Copying I:\MAVENLOCALREPO\maasintern\NYRETEST\xdocs\200_Dokumentation_Publikation der Website\index.xml.bak to I:\MAVENLOCALREPO\maasintern\NYRETEST\target\pdf\200_Dokumentation_Publikation der Website\index.xml.bak
      [copy] [VERBOSE] Copying I:\MAVENLOCALREPO\maasintern\NYRETEST\xdocs\102_Dokumentation_Maven Reports\index.xml to I:\MAVENLOCALREPO\maasintern\NYRETEST\target\pdf\102_Dokumentation_Maven Reports\index.xml
      [copy] [VERBOSE] Copying I:\MAVENLOCALREPO\maasintern\NYRETEST\xdocs\001_ContentManagement\index.xml.bak to I:\MAVENLOCALREPO\maasintern\NYRETEST\target\pdf\001_ContentManagement\index.xml.bak
      [copy] [VERBOSE] Copying I:\MAVENLOCALREPO\maasintern\NYRETEST\xdocs\navigation.xml to I:\MAVENLOCALREPO\maasintern\NYRETEST\target\pdf\navigation.xml
      [copy] [VERBOSE] Copying I:\MAVENLOCALREPO\maasintern\NYRETEST\xdocs\101_Dokumentation_Javadoc\index.xml.bak to I:\MAVENLOCALREPO\maasintern\NYRETEST\target\pdf\101_Dokumentation_Javadoc\index.xml.bak
      [copy] [VERBOSE] Copying I:\MAVENLOCALREPO\maasintern\NYRETEST\xdocs\000_MavenDocumentation\maven.pdf to I:\MAVENLOCALREPO\maasintern\NYRETEST\target\pdf\000_MavenDocumentation\maven.pdf
      [copy] [VERBOSE] Copying I:\MAVENLOCALREPO\maasintern\NYRETEST\xdocs\200_Dokumentation_Publikation der Website\index.xml to I:\MAVENLOCALREPO\maasintern\NYRETEST\target\pdf\200_Dokumentation_Publikation der Website\index.xml
      [copy] [VERBOSE] Copying I:\MAVENLOCALREPO\maasintern\NYRETEST\xdocs\stylesheets\print.css to I:\MAVENLOCALREPO\maasintern\NYRETEST\target\pdf\stylesheets\print.css
      [copy] [VERBOSE] Copying I:\MAVENLOCALREPO\maasintern\NYRETEST\xdocs\101_Dokumentation_Javadoc\index.xml to I:\MAVENLOCALREPO\maasintern\NYRETEST\target\pdf\101_Dokumentation_Javadoc\index.xml
      [copy] [VERBOSE] Copying I:\MAVENLOCALREPO\maasintern\NYRETEST\xdocs\stylesheets\maven-theme.css to I:\MAVENLOCALREPO\maasintern\NYRETEST\target\pdf\stylesheets\maven-theme.css
      [copy] [DEBUG] fileset: Setup scanner in dir I:\MAVENLOCALREPO\maasintern\NYRETEST\target\docs with patternSet

      { includes: [**/*.gif, **/*.jpg, **/*.png, **/maas/*.*] excludes: [] }

      [copy] [VERBOSE] images\add.gif omitted as images/add.gif is up to date.
      [copy] [VERBOSE] images\collapsed.gif omitted as images/collapsed.gif is up to date.
      [copy] [VERBOSE] images\expanded.gif omitted as images/expanded.gif is up to date.
      [copy] [VERBOSE] images\external-classic.png omitted as images/external-classic.png is up to date.
      [copy] [VERBOSE] images\external.png omitted as images/external.png is up to date.
      [copy] [VERBOSE] images\file.gif omitted as images/file.gif is up to date.
      [copy] [VERBOSE] images\fix.gif omitted as images/fix.gif is up to date.
      [copy] [VERBOSE] images\folder-closed.gif omitted as images/folder-closed.gif is up to date.
      [copy] [VERBOSE] images\folder-open.gif omitted as images/folder-open.gif is up to date.
      [copy] [VERBOSE] images\help_logo.gif omitted as images/help_logo.gif is up to date.
      [copy] [VERBOSE] images\icon_alert.gif omitted as images/icon_alert.gif is up to date.
      [copy] [VERBOSE] images\icon_alertsml.gif omitted as images/icon_alertsml.gif is up to date.
      [copy] [VERBOSE] images\icon_arrowfolder1_sml.gif omitted as images/icon_arrowfolder1_sml.gif is up to date.
      [copy] [VERBOSE] images\icon_arrowfolder2_sml.gif omitted as images/icon_arrowfolder2_sml.gif is up to date.
      [copy] [VERBOSE] images\icon_arrowfolderclosed1_sml.gif omitted as images/icon_arrowfolderclosed1_sml.gif is up to date.
      [copy] [VERBOSE] images\icon_arrowfolderopen2_sml.gif omitted as images/icon_arrowfolderopen2_sml.gif is up to date.
      [copy] [VERBOSE] images\icon_arrowmembers1_sml.gif omitted as images/icon_arrowmembers1_sml.gif is up to date.
      [copy] [VERBOSE] images\icon_arrowmembers2_sml.gif omitted as images/icon_arrowmembers2_sml.gif is up to date.
      [copy] [VERBOSE] images\icon_arrowusergroups1_sml.gif omitted as images/icon_arrowusergroups1_sml.gif is up to date.
      [copy] [VERBOSE] images\icon_arrowusergroups2_sml.gif omitted as images/icon_arrowusergroups2_sml.gif is up to date.
      [copy] [VERBOSE] images\icon_arrowwaste1_sml.gif omitted as images/icon_arrowwaste1_sml.gif is up to date.
      [copy] [VERBOSE] images\icon_arrowwaste2_sml.gif omitted as images/icon_arrowwaste2_sml.gif is up to date.
      [copy] [VERBOSE] images\icon_confirmsml.gif omitted as images/icon_confirmsml.gif is up to date.
      [copy] [VERBOSE] images\icon_doc_lrg.gif omitted as images/icon_doc_lrg.gif is up to date.
      [copy] [VERBOSE] images\icon_doc_sml.gif omitted as images/icon_doc_sml.gif is up to date.
      [copy] [VERBOSE] images\icon_error_lrg.gif omitted as images/icon_error_lrg.gif is up to date.
      [copy] [VERBOSE] images\icon_error_sml.gif omitted as images/icon_error_sml.gif is up to date.
      [copy] [VERBOSE] images\icon_folder_lrg.gif omitted as images/icon_folder_lrg.gif is up to date.
      [copy] [VERBOSE] images\icon_folder_sml.gif omitted as images/icon_folder_sml.gif is up to date.
      [copy] [VERBOSE] images\icon_help_lrg.gif omitted as images/icon_help_lrg.gif is up to date.
      [copy] [VERBOSE] images\icon_help_sml.gif omitted as images/icon_help_sml.gif is up to date.
      [copy] [VERBOSE] images\icon_infosml.gif omitted as images/icon_infosml.gif is up to date.
      [copy] [VERBOSE] images\icon_info_lrg.gif omitted as images/icon_info_lrg.gif is up to date.
      [copy] [VERBOSE] images\icon_info_sml.gif omitted as images/icon_info_sml.gif is up to date.
      [copy] [VERBOSE] images\icon_members_lrg.gif omitted as images/icon_members_lrg.gif is up to date.
      [copy] [VERBOSE] images\icon_members_sml.gif omitted as images/icon_members_sml.gif is up to date.
      [copy] [VERBOSE] images\icon_sortdown.gif omitted as images/icon_sortdown.gif is up to date.
      [copy] [VERBOSE] images\icon_sortleft.gif omitted as images/icon_sortleft.gif is up to date.
      [copy] [VERBOSE] images\icon_sortright.gif omitted as images/icon_sortright.gif is up to date.
      [copy] [VERBOSE] images\icon_sortup.gif omitted as images/icon_sortup.gif is up to date.
      [copy] [VERBOSE] images\icon_success_lrg.gif omitted as images/icon_success_lrg.gif is up to date.
      [copy] [VERBOSE] images\icon_success_sml.gif omitted as images/icon_success_sml.gif is up to date.
      [copy] [VERBOSE] images\icon_usergroups_lrg.gif omitted as images/icon_usergroups_lrg.gif is up to date.
      [copy] [VERBOSE] images\icon_usergroups_sml.gif omitted as images/icon_usergroups_sml.gif is up to date.
      [copy] [VERBOSE] images\icon_warning_lrg.gif omitted as images/icon_warning_lrg.gif is up to date.
      [copy] [VERBOSE] images\icon_warning_sml.gif omitted as images/icon_warning_sml.gif is up to date.
      [copy] [VERBOSE] images\icon_waste_lrg.gif omitted as images/icon_waste_lrg.gif is up to date.
      [copy] [VERBOSE] images\icon_waste_sml.gif omitted as images/icon_waste_sml.gif is up to date.
      [copy] [VERBOSE] images\logos\maven-bolt.png omitted as images/logos/maven-bolt.png is up to date.
      [copy] [VERBOSE] images\logos\maven-brewed.png omitted as images/logos/maven-brewed.png is up to date.
      [copy] [VERBOSE] images\logos\maven-build-successfull.png omitted as images/logos/maven-build-successfull.png is up to date.
      [copy] [VERBOSE] images\logos\maven-built.png omitted as images/logos/maven-built.png is up to date.
      [copy] [VERBOSE] images\logos\maven-bulldozer.png omitted as images/logos/maven-bulldozer.png is up to date.
      [copy] [VERBOSE] images\logos\maven-button-1.png omitted as images/logos/maven-button-1.png is up to date.
      [copy] [VERBOSE] images\logos\maven-button-2.png omitted as images/logos/maven-button-2.png is up to date.
      [copy] [VERBOSE] images\logos\maven-button-3.png omitted as images/logos/maven-button-3.png is up to date.
      [copy] [VERBOSE] images\logos\maven-button-4.png omitted as images/logos/maven-button-4.png is up to date.
      [copy] [VERBOSE] images\logos\maven-button-5.png omitted as images/logos/maven-button-5.png is up to date.
      [copy] [VERBOSE] images\logos\maven-button-black.png omitted as images/logos/maven-button-black.png is up to date.
      [copy] [VERBOSE] images\logos\maven-button-blue.png omitted as images/logos/maven-button-blue.png is up to date.
      [copy] [VERBOSE] images\logos\maven-button-copper.png omitted as images/logos/maven-button-copper.png is up to date.
      [copy] [VERBOSE] images\logos\maven-button-green.png omitted as images/logos/maven-button-green.png is up to date.
      [copy] [VERBOSE] images\logos\maven-button-pinky.png omitted as images/logos/maven-button-pinky.png is up to date.
      [copy] [VERBOSE] images\logos\maven-button-purple.png omitted as images/logos/maven-button-purple.png is up to date.
      [copy] [VERBOSE] images\logos\maven-button-teal.png omitted as images/logos/maven-button-teal.png is up to date.
      [copy] [VERBOSE] images\logos\maven-feather.png omitted as images/logos/maven-feather.png is up to date.
      [copy] [VERBOSE] images\logos\maven-frankenstein.png omitted as images/logos/maven-frankenstein.png is up to date.
      [copy] [VERBOSE] images\logos\maven-mavenfactured.png omitted as images/logos/maven-mavenfactured.png is up to date.
      [copy] [VERBOSE] images\logos\maven-petesucks.png omitted as images/logos/maven-petesucks.png is up to date.
      [copy] [VERBOSE] images\logos\maven-propaganda-2.png omitted as images/logos/maven-propaganda-2.png is up to date.
      [copy] [VERBOSE] images\logos\maven-propaganda.png omitted as images/logos/maven-propaganda.png is up to date.
      [copy] [VERBOSE] images\logos\maven-redgreen.png omitted as images/logos/maven-redgreen.png is up to date.
      [copy] [VERBOSE] images\maas\logo_maas_www.jpg omitted as images/maas/logo_maas_www.jpg is up to date.
      [copy] [VERBOSE] images\maas\logo_maas_www.svg omitted as images/maas/logo_maas_www.svg is up to date.
      [copy] [VERBOSE] images\maas\logo_maas_www.tif omitted as images/maas/logo_maas_www.tif is up to date.
      [copy] [VERBOSE] images\maas\maaslogo.gif omitted as images/maas/maaslogo.gif is up to date.
      [copy] [VERBOSE] images\maas\MaasTopBannerFragment.jpg omitted as images/maas/MaasTopBannerFragment.jpg is up to date.
      [copy] [VERBOSE] images\maas\maas_looperman.jpg omitted as images/maas/maas_looperman.jpg is up to date.
      [copy] [VERBOSE] images\maas\ProductLogo.jpg omitted as images/maas/ProductLogo.jpg is up to date.
      [copy] [VERBOSE] images\newwindow-classic.png omitted as images/newwindow-classic.png is up to date.
      [copy] [VERBOSE] images\newwindow.png omitted as images/newwindow.png is up to date.
      [copy] [VERBOSE] images\none.png omitted as images/none.png is up to date.
      [copy] [VERBOSE] images\nw_maj.gif omitted as images/nw_maj.gif is up to date.
      [copy] [VERBOSE] images\nw_maj_hi.gif omitted as images/nw_maj_hi.gif is up to date.
      [copy] [VERBOSE] images\nw_maj_rond.gif omitted as images/nw_maj_rond.gif is up to date.
      [copy] [VERBOSE] images\nw_med.gif omitted as images/nw_med.gif is up to date.
      [copy] [VERBOSE] images\nw_med_hi.gif omitted as images/nw_med_hi.gif is up to date.
      [copy] [VERBOSE] images\nw_med_rond.gif omitted as images/nw_med_rond.gif is up to date.
      [copy] [VERBOSE] images\nw_min.gif omitted as images/nw_min.gif is up to date.
      [copy] [VERBOSE] images\nw_min_036.gif omitted as images/nw_min_036.gif is up to date.
      [copy] [VERBOSE] images\nw_min_hi.gif omitted as images/nw_min_hi.gif is up to date.
      [copy] [VERBOSE] images\pdf.gif omitted as images/pdf.gif is up to date.
      [copy] [VERBOSE] images\poweredby_036.gif omitted as images/poweredby_036.gif is up to date.
      [copy] [VERBOSE] images\product_logo.gif omitted as images/product_logo.gif is up to date.
      [copy] [VERBOSE] images\remove.gif omitted as images/remove.gif is up to date.
      [copy] [VERBOSE] images\se_maj_rond.gif omitted as images/se_maj_rond.gif is up to date.
      [copy] [VERBOSE] images\strich.gif omitted as images/strich.gif is up to date.
      [copy] [VERBOSE] images\sw_maj_rond.gif omitted as images/sw_maj_rond.gif is up to date.
      [copy] [VERBOSE] images\sw_med_rond.gif omitted as images/sw_med_rond.gif is up to date.
      [copy] [VERBOSE] images\sw_min.gif omitted as images/sw_min.gif is up to date.
      [copy] [VERBOSE] images\update.gif omitted as images/update.gif is up to date.
      [copy] [DEBUG] fileset: Setup scanner in dir I:\MAVENLOCALREPO\.maven\cache\maven-pdf-plugin-2.2.1\plugin-resources with patternSet

      { includes: [userconfig.xml, fonts/*.*] excludes: [] }

      [copy] [VERBOSE] fonts\gara.ttf omitted as fonts/gara.ttf is up to date.
      [copy] [VERBOSE] fonts\garabd.ttf omitted as fonts/garabd.ttf is up to date.
      [copy] [VERBOSE] fonts\garait.ttf omitted as fonts/garait.ttf is up to date.
      [copy] [VERBOSE] fonts\ttf-gara.xml omitted as fonts/ttf-gara.xml is up to date.
      [copy] [VERBOSE] fonts\ttf-garabd.xml omitted as fonts/ttf-garabd.xml is up to date.
      [copy] [VERBOSE] fonts\ttf-garait.xml omitted as fonts/ttf-garait.xml is up to date.
      [copy] [VERBOSE] userconfig.xml omitted as userconfig.xml is up to date.

      fo:fo:
      [echo] Generating I:\MAVENLOCALREPO\maasintern\NYRETEST/target/pdf/project.fo from I:\MAVENLOCALREPO\maasintern\NYRETEST/xdocs/navigation.xml ...
      [available] [VERBOSE] Found: xdocs\navigation.xml
      file:///I:/MAVENLOCALREPO/.maven/cache/maven-pdf-plugin-2.2.1/plugin-resources/maasproject2fo.xslt; Zeile #165; Spalte #46; Creating XSL:FO for I:\MAVENLOCALREPO\maasintern\NYRETEST/target/pdf/001_ContentManagement/index.xml
      file:///I:/MAVENLOCALREPO/.maven/cache/maven-pdf-plugin-2.2.1/plugin-resources/maasproject2fo.xslt; Zeile #165; Spalte #46; Creating XSL:FO for I:\MAVENLOCALREPO\maasintern\NYRETEST/target/pdf/101_Dokumentation_Javadoc/index.xml
      file:///I:/MAVENLOCALREPO/.maven/cache/maven-pdf-plugin-2.2.1/plugin-resources/maasproject2fo.xslt; Zeile #165; Spalte #46; Creating XSL:FO for I:\MAVENLOCALREPO\maasintern\NYRETEST/target/pdf/101_Dokumentation_Javadoc/index.xml
      file:///I:/MAVENLOCALREPO/.maven/cache/maven-pdf-plugin-2.2.1/plugin-resources/maasproject2fo.xslt; Zeile #165; Spalte #46; Creating XSL:FO for I:\MAVENLOCALREPO\maasintern\NYRETEST/target/pdf/102_Dokumentation_Maven Reports/index.xml
      file:///I:/MAVENLOCALREPO/.maven/cache/maven-pdf-plugin-2.2.1/plugin-resources/maasproject2fo.xslt; Zeile #165; Spalte #46; Creating XSL:FO for I:\MAVENLOCALREPO\maasintern\NYRETEST/target/pdf/104_Dokumentation_Index_Navigation/index.xml
      file:///I:/MAVENLOCALREPO/.maven/cache/maven-pdf-plugin-2.2.1/plugin-resources/maasproject2fo.xslt; Zeile #165; Spalte #46; Creating XSL:FO for I:\MAVENLOCALREPO\maasintern\NYRETEST/target/pdf/104_Dokumentation_Index_Navigation/index.xml
      file:///I:/MAVENLOCALREPO/.maven/cache/maven-pdf-plugin-2.2.1/plugin-resources/maasproject2fo.xslt; Zeile #165; Spalte #46; Creating XSL:FO for I:\MAVENLOCALREPO\maasintern\NYRETEST/target/pdf/105_Dokumentation_xdocs allgemein/index.xml
      file:///I:/MAVENLOCALREPO/.maven/cache/maven-pdf-plugin-2.2.1/plugin-resources/maasproject2fo.xslt; Zeile #165; Spalte #46; Creating XSL:FO for I:\MAVENLOCALREPO\maasintern\NYRETEST/target/pdf/106_Dokumentation_andere Formate/index.xml
      file:///I:/MAVENLOCALREPO/.maven/cache/maven-pdf-plugin-2.2.1/plugin-resources/maasproject2fo.xslt; Zeile #165; Spalte #46; Creating XSL:FO for I:\MAVENLOCALREPO\maasintern\NYRETEST/target/pdf/103_Dokumentation_Sourcecode_Listings/index.xml
      file:///I:/MAVENLOCALREPO/.maven/cache/maven-pdf-plugin-2.2.1/plugin-resources/maasproject2fo.xslt; Zeile #165; Spalte #46; Creating XSL:FO for I:\MAVENLOCALREPO\maasintern\NYRETEST/target/pdf/200_Dokumentation_Publikation der Website/index.xml
      file:///I:/MAVENLOCALREPO/.maven/cache/maven-pdf-plugin-2.2.1/plugin-resources/maasproject2fo.xslt; Zeile #165; Spalte #46; Creating XSL:FO for I:\MAVENLOCALREPO\maasintern\NYRETEST/target/pdf/900_Dokumentation_andere Verfahren/index.xml
      file:///I:/MAVENLOCALREPO/.maven/cache/maven-pdf-plugin-2.2.1/plugin-resources/fo-table-column-widths.xslt; Zeile #349; Spalte #26; Cell (1,1) text()='This is a table' rowspan=1 colspan=1 width=NaN
      file:///I:/MAVENLOCALREPO/.maven/cache/maven-pdf-plugin-2.2.1/plugin-resources/fo-table-column-widths.xslt; Zeile #351; Spalte #26; Current cell mask : ---------in 1--------out
      file:///I:/MAVENLOCALREPO/.maven/cache/maven-pdf-plugin-2.2.1/plugin-resources/fo-table-column-widths.xslt; Zeile #352; Spalte #26; Next row mask : ----------in ----------out
      file:///I:/MAVENLOCALREPO/.maven/cache/maven-pdf-plugin-2.2.1/plugin-resources/fo-table-column-widths.xslt; Zeile #353; Spalte #26; Estimated cell widths:
      file:///I:/MAVENLOCALREPO/.maven/cache/maven-pdf-plugin-2.2.1/plugin-resources/fo-table-column-widths.xslt; Zeile #355; Spalte #26; Cell widths so far : 5? 5? 5? 5? 5? 5? 5? 5? 5? 5?
      file:///I:/MAVENLOCALREPO/.maven/cache/maven-pdf-plugin-2.2.1/plugin-resources/fo-table-column-widths.xslt; Zeile #199; Spalte #34; Columns= 1 (1 resizable), width=5, leftover=95
      file:///I:/MAVENLOCALREPO/.maven/cache/maven-pdf-plugin-2.2.1/plugin-resources/maasproject2fo.xslt; Zeile #165; Spalte #46; Creating XSL:FO for I:\MAVENLOCALREPO\maasintern\NYRETEST/target/pdf.xml
      file:///I:/MAVENLOCALREPO/.maven/cache/maven-pdf-plugin-2.2.1/plugin-resources/maasproject2fo.xslt; Zeile #168; Spalte #97; Angefordertes Dokument kann nicht geladen werden: i:\MAVENLOCALREPO\maasintern\NYRETEST\target\pdf.xml (Das System kann die angegebene Datei nicht finden)

      pdf:pdf:
      [echo] Generating I:\MAVENLOCALREPO\maasintern\NYRETEST/target/pdf/nyretest.pdf ...
      [echo] Config file: I:\MAVENLOCALREPO\maasintern\NYRETEST/target/pdf/userconfig.xml
      [java] [VERBOSE] Executing 'E:\j2sdk1.4.2_06\jre\bin\java.exe' with arguments:
      '-Xmx500m'
      '-Djavax.xml.transform.TransformerFactory=org.apache.xalan.processor.TransformerFactoryImpl'
      '-classpath'
      'I:\MAVENLOCALREPO\.maven\repository\fop\jars\fop-0.20.5.jar;I:\MAVENLOCALREPO\.maven\repository\batik\jars\batik-1.5.jar;I:\MAVENLOCALREPO\.maven\repository\batik\jars\batik-awt-util-1.5.jar;I:\MAVENLOCALREPO\.maven\repository\batik\jars\batik-bridge-1.5.jar;I:\MAVENLOCALREPO\.maven\repository\batik\jars\batik-css-1.5.jar;I:\MAVENLOCALREPO\.maven\repository\batik\jars\batik-dom-1.5.jar;I:\MAVENLOCALREPO\.maven\repository\batik\jars\batik-ext-1.5.jar;I:\MAVENLOCALREPO\.maven\repository\batik\jars\batik-extension-1.5.jar;I:\MAVENLOCALREPO\.maven\repository\batik\jars\batik-gui-util-1.5.jar;I:\MAVENLOCALREPO\.maven\repository\batik\jars\batik-gvt-1.5.jar;I:\MAVENLOCALREPO\.maven\repository\batik\jars\batik-parser-1.5.jar;I:\MAVENLOCALREPO\.maven\repository\batik\jars\batik-rasterizer-1.5.jar;I:\MAVENLOCALREPO\.maven\repository\batik\jars\batik-script-1.5.jar;I:\MAVENLOCALREPO\.maven\repository\batik\jars\batik-svg-dom-1.5.jar;I:\MAVENLOCALREPO\.maven\repository\batik\jars\batik-svggen-1.5.jar;I:\MAVENLOCALREPO\.maven\repository\batik\jars\batik-swing-1.5.jar;I:\MAVENLOCALREPO\.maven\repository\batik\jars\batik-transcoder-1.5.jar;I:\MAVENLOCALREPO\.maven\repository\batik\jars\batik-util-1.5.jar;I:\MAVENLOCALREPO\.maven\repository\batik\jars\batik-xml-1.5.jar;I:\MAVENLOCALREPO\.maven\repository\logkit\jars\logkit-1.2.2.jar;I:\MAVENLOCALREPO\.maven\repository\avalon-framework\jars\avalon-framework-4.1.5.jar;I:\MAVENLOCALREPO\.maven\repository\xerces\jars\xerces-2.4.0.jar;I:\MAVENLOCALREPO\.maven\repository\xml-apis\jars\xml-apis-1.0.b2.jar'
      'org.apache.fop.apps.Fop'
      '-c'
      'I:\MAVENLOCALREPO\maasintern\NYRETEST/target/pdf/userconfig.xml'
      '-fo'
      'I:\MAVENLOCALREPO\maasintern\NYRETEST/target/pdf/project.fo'
      '-pdf'
      'I:\MAVENLOCALREPO\maasintern\NYRETEST/target/pdf/nyretest.pdf'

      The ' characters around the executable and arguments are
      not part of the command.

      [java] [DEBUG] Execute:Java13CommandLauncher: Executing 'E:\j2sdk1.4.2_06\jre\bin\java.exe' with arguments:
      '-Xmx500m'
      '-Djavax.xml.transform.TransformerFactory=org.apache.xalan.processor.TransformerFactoryImpl'
      '-classpath'
      'I:\MAVENLOCALREPO\.maven\repository\fop\jars\fop-0.20.5.jar;I:\MAVENLOCALREPO\.maven\repository\batik\jars\batik-1.5.jar;I:\MAVENLOCALREPO\.maven\repository\batik\jars\batik-awt-util-1.5.jar;I:\MAVENLOCALREPO\.maven\repository\batik\jars\batik-bridge-1.5.jar;I:\MAVENLOCALREPO\.maven\repository\batik\jars\batik-css-1.5.jar;I:\MAVENLOCALREPO\.maven\repository\batik\jars\batik-dom-1.5.jar;I:\MAVENLOCALREPO\.maven\repository\batik\jars\batik-ext-1.5.jar;I:\MAVENLOCALREPO\.maven\repository\batik\jars\batik-extension-1.5.jar;I:\MAVENLOCALREPO\.maven\repository\batik\jars\batik-gui-util-1.5.jar;I:\MAVENLOCALREPO\.maven\repository\batik\jars\batik-gvt-1.5.jar;I:\MAVENLOCALREPO\.maven\repository\batik\jars\batik-parser-1.5.jar;I:\MAVENLOCALREPO\.maven\repository\batik\jars\batik-rasterizer-1.5.jar;I:\MAVENLOCALREPO\.maven\repository\batik\jars\batik-script-1.5.jar;I:\MAVENLOCALREPO\.maven\repository\batik\jars\batik-svg-dom-1.5.jar;I:\MAVENLOCALREPO\.maven\repository\batik\jars\batik-svggen-1.5.jar;I:\MAVENLOCALREPO\.maven\repository\batik\jars\batik-swing-1.5.jar;I:\MAVENLOCALREPO\.maven\repository\batik\jars\batik-transcoder-1.5.jar;I:\MAVENLOCALREPO\.maven\repository\batik\jars\batik-util-1.5.jar;I:\MAVENLOCALREPO\.maven\repository\batik\jars\batik-xml-1.5.jar;I:\MAVENLOCALREPO\.maven\repository\logkit\jars\logkit-1.2.2.jar;I:\MAVENLOCALREPO\.maven\repository\avalon-framework\jars\avalon-framework-4.1.5.jar;I:\MAVENLOCALREPO\.maven\repository\xerces\jars\xerces-2.4.0.jar;I:\MAVENLOCALREPO\.maven\repository\xml-apis\jars\xml-apis-1.0.b2.jar'
      'org.apache.fop.apps.Fop'
      '-c'
      'I:\MAVENLOCALREPO\maasintern\NYRETEST/target/pdf/userconfig.xml'
      '-fo'
      'I:\MAVENLOCALREPO\maasintern\NYRETEST/target/pdf/project.fo'
      '-pdf'
      'I:\MAVENLOCALREPO\maasintern\NYRETEST/target/pdf/nyretest.pdf'

      The ' characters around the executable and arguments are
      not part of the command.

      [java] [INFO] Using org.apache.xerces.parsers.SAXParser as SAX2 Parser
      [java] [INFO] Using org.apache.xerces.parsers.SAXParser as SAX2 Parser
      [java] [INFO] FOP 0.20.5
      [java] [INFO] Using org.apache.xerces.parsers.SAXParser as SAX2 Parser
      [java] [INFO] building formatting object tree
      [java] [INFO] setting up fonts
      [java] [INFO] [1]
      [java] java.lang.NoSuchMethodError: org.apache.batik.bridge.UnitProcessor.createContext(Lorg/apache/batik/bridge/BridgeContext;Lorg/w3c/dom/Element;)Lorg/apache/batik/util/UnitProcessor$Context;
      [java] at org.apache.fop.image.analyser.SVGReader.loadImage(SVGReader.java:107)
      [java] at org.apache.fop.image.analyser.SVGReader.verifySignature(SVGReader.java:85)
      [java] at org.apache.fop.image.analyser.ImageReaderFactory.Make(ImageReaderFactory.java:129)
      [java] at org.apache.fop.image.FopImageFactory.Make(FopImageFactory.java:181)
      [java] at org.apache.fop.fo.flow.ExternalGraphic.layout(ExternalGraphic.java:188)
      [java] at org.apache.fop.fo.flow.Block.layout(Block.java:257)
      [java] at org.apache.fop.fo.flow.TableCell.layout(TableCell.java:326)
      [java] at org.apache.fop.fo.flow.TableRow.layout(TableRow.java:360)
      [java] at org.apache.fop.fo.flow.AbstractTableBody.layout(AbstractTableBody.java:236)
      [java] at org.apache.fop.fo.flow.Table.layout(Table.java:302)
      [java] at org.apache.fop.fo.flow.Block.layout(Block.java:257)
      [java] at org.apache.fop.fo.flow.AbstractFlow.layout(AbstractFlow.java:154)
      [java] at org.apache.fop.fo.flow.AbstractFlow.layout(AbstractFlow.java:110)
      [java] at org.apache.fop.fo.pagination.PageSequence.makePage(PageSequence.java:400)
      [java] at org.apache.fop.fo.pagination.PageSequence.format(PageSequence.java:338)
      [java] at org.apache.fop.apps.StreamRenderer.render(StreamRenderer.java:262)
      [java] at org.apache.fop.fo.FOTreeBuilder.endElement(FOTreeBuilder.java:223)
      [java] at org.apache.xerces.parsers.AbstractSAXParser.endElement(Unknown Source)
      [java] at org.apache.xerces.impl.XMLNSDocumentScannerImpl.scanEndElement(Unknown Source)
      [java] at org.apache.xerces.impl.XMLDocumentFragmentScannerImpl$FragmentContentDispatcher.dispatch(Unknown Source)
      [java] at org.apache.xerces.impl.XMLDocumentFragmentScannerImpl.scanDocument(Unknown Source)
      [java] at org.apache.xerces.parsers.XML11Configuration.parse(Unknown Source)
      [java] at org.apache.xerces.parsers.DTDConfiguration.parse(Unknown Source)
      [java] at org.apache.xerces.parsers.XMLParser.parse(Unknown Source)
      [java] at org.apache.xerces.parsers.AbstractSAXParser.parse(Unknown Source)
      [java] at org.apache.fop.apps.Driver.render(Driver.java:498)
      [java] at org.apache.fop.apps.CommandLineStarter.run(CommandLineStarter.java:106)
      [java] at org.apache.fop.apps.Fop.main(Fop.java:62)
      [java] Exception in thread "main"
      popping off org.apache.maven.jelly.MavenJellyContext@1722456 for org.apache.maven.jelly.MavenJellyContext@afa68a in maven-xdoc-plugin:maven-xdoc-plugin
      popping off org.apache.maven.jelly.MavenJellyContext@19cd75a for org.apache.maven.jelly.MavenJellyContext@1fe8ce8 in maven-pdf-plugin:maven-pdf-plugin
      popping off org.apache.maven.jelly.MavenJellyContext@149eb9f for org.apache.maven.jelly.MavenJellyContext@c3014 in maven-pom-plugin:maven-pom-plugin
      popping off org.apache.maven.jelly.MavenJellyContext@aae86e for org.apache.maven.jelly.MavenJellyContext@81a197 in maven-html2xdoc-plugin:maven-html2xdoc-plugin
      popping off org.apache.maven.jelly.MavenJellyContext@61a907 for org.apache.maven.jelly.MavenJellyContext@1a0225b in maven-artifact-plugin:maven-artifact-plugin
      popping off org.apache.maven.jelly.MavenJellyContext@42552c for org.apache.maven.jelly.MavenJellyContext@e5bbd6 in nyregroup:nyretest

      BUILD FAILED
      File...... I:\MAVENLOCALREPO\.maven\cache\maven-pdf-plugin-2.2.1\plugin.jelly
      Element... java
      Line...... 316
      Column.... 94
      Java returned: 1
      com.werken.werkz.UnattainableGoalException: Unable to obtain goal [pdf:pdf] – I:\MAVENLOCALREPO\.maven\cache\maven-pdf-plugin-2.2.1\plugin.jelly:316:94: <java> Java returned: 1
      at com.werken.werkz.Goal.fire(Goal.java:646)
      at com.werken.werkz.Goal.attain(Goal.java:575)
      at com.werken.werkz.Goal.attainPrecursors(Goal.java:488)
      at com.werken.werkz.Goal.attain(Goal.java:573)
      at org.apache.maven.plugin.PluginManager.attainGoals(PluginManager.java:671)
      at org.apache.maven.MavenSession.attainGoals(MavenSession.java:263)
      at org.apache.maven.cli.App.doMain(App.java:488)
      at org.apache.maven.cli.App.main(App.java:1239)
      at sun.reflect.NativeMethodAccessorImpl.invoke0(Native Method)
      at sun.reflect.NativeMethodAccessorImpl.invoke(NativeMethodAccessorImpl.java:39)
      at sun.reflect.DelegatingMethodAccessorImpl.invoke(DelegatingMethodAccessorImpl.java:25)
      at java.lang.reflect.Method.invoke(Method.java:324)
      at com.werken.forehead.Forehead.run(Forehead.java:551)
      at com.werken.forehead.Forehead.main(Forehead.java:581)
      org.apache.commons.jelly.JellyTagException: I:\MAVENLOCALREPO\.maven\cache\maven-pdf-plugin-2.2.1\plugin.jelly:316:94: <java> Java returned: 1
      at org.apache.commons.jelly.impl.TagScript.handleException(TagScript.java:683)
      at org.apache.commons.jelly.impl.TagScript.run(TagScript.java:288)
      at org.apache.commons.jelly.impl.ScriptBlock.run(ScriptBlock.java:135)
      at org.apache.maven.jelly.tags.werkz.MavenGoalTag.runBodyTag(MavenGoalTag.java:79)
      at org.apache.maven.jelly.tags.werkz.MavenGoalTag$MavenGoalAction.performAction(MavenGoalTag.java:110)
      at com.werken.werkz.Goal.fire(Goal.java:639)
      at com.werken.werkz.Goal.attain(Goal.java:575)
      at com.werken.werkz.Goal.attainPrecursors(Goal.java:488)
      at com.werken.werkz.Goal.attain(Goal.java:573)
      at org.apache.maven.plugin.PluginManager.attainGoals(PluginManager.java:671)
      at org.apache.maven.MavenSession.attainGoals(MavenSession.java:263)
      at org.apache.maven.cli.App.doMain(App.java:488)
      at org.apache.maven.cli.App.main(App.java:1239)
      at sun.reflect.NativeMethodAccessorImpl.invoke0(Native Method)
      at sun.reflect.NativeMethodAccessorImpl.invoke(NativeMethodAccessorImpl.java:39)
      at sun.reflect.DelegatingMethodAccessorImpl.invoke(DelegatingMethodAccessorImpl.java:25)
      at java.lang.reflect.Method.invoke(Method.java:324)
      at com.werken.forehead.Forehead.run(Forehead.java:551)
      at com.werken.forehead.Forehead.main(Forehead.java:581)
      Caused by: Java returned: 1
      at org.apache.tools.ant.taskdefs.Java.execute(Java.java:110)
      at org.apache.tools.ant.Task.perform(Task.java:341)
      at org.apache.commons.jelly.tags.ant.AntTag.doTag(AntTag.java:185)
      at org.apache.commons.jelly.impl.TagScript.run(TagScript.java:279)
      ... 17 more
      Root cause
      Java returned: 1
      at org.apache.tools.ant.taskdefs.Java.execute(Java.java:110)
      at org.apache.tools.ant.Task.perform(Task.java:341)
      at org.apache.commons.jelly.tags.ant.AntTag.doTag(AntTag.java:185)
      at org.apache.commons.jelly.impl.TagScript.run(TagScript.java:279)
      at org.apache.commons.jelly.impl.ScriptBlock.run(ScriptBlock.java:135)
      at org.apache.maven.jelly.tags.werkz.MavenGoalTag.runBodyTag(MavenGoalTag.java:79)
      at org.apache.maven.jelly.tags.werkz.MavenGoalTag$MavenGoalAction.performAction(MavenGoalTag.java:110)
      at com.werken.werkz.Goal.fire(Goal.java:639)
      at com.werken.werkz.Goal.attain(Goal.java:575)
      at com.werken.werkz.Goal.attainPrecursors(Goal.java:488)
      at com.werken.werkz.Goal.attain(Goal.java:573)
      at org.apache.maven.plugin.PluginManager.attainGoals(PluginManager.java:671)
      at org.apache.maven.MavenSession.attainGoals(MavenSession.java:263)
      at org.apache.maven.cli.App.doMain(App.java:488)
      at org.apache.maven.cli.App.main(App.java:1239)
      at sun.reflect.NativeMethodAccessorImpl.invoke0(Native Method)
      at sun.reflect.NativeMethodAccessorImpl.invoke(NativeMethodAccessorImpl.java:39)
      at sun.reflect.DelegatingMethodAccessorImpl.invoke(DelegatingMethodAccessorImpl.java:25)
      at java.lang.reflect.Method.invoke(Method.java:324)
      at com.werken.forehead.Forehead.run(Forehead.java:551)
      at com.werken.forehead.Forehead.main(Forehead.java:581)
      Root cause
      Java returned: 1
      at org.apache.tools.ant.taskdefs.Java.execute(Java.java:110)
      at org.apache.tools.ant.Task.perform(Task.java:341)
      at org.apache.commons.jelly.tags.ant.AntTag.doTag(AntTag.java:185)
      at org.apache.commons.jelly.impl.TagScript.run(TagScript.java:279)
      at org.apache.commons.jelly.impl.ScriptBlock.run(ScriptBlock.java:135)
      at org.apache.maven.jelly.tags.werkz.MavenGoalTag.runBodyTag(MavenGoalTag.java:79)
      at org.apache.maven.jelly.tags.werkz.MavenGoalTag$MavenGoalAction.performAction(MavenGoalTag.java:110)
      at com.werken.werkz.Goal.fire(Goal.java:639)
      at com.werken.werkz.Goal.attain(Goal.java:575)
      at com.werken.werkz.Goal.attainPrecursors(Goal.java:488)
      at com.werken.werkz.Goal.attain(Goal.java:573)
      at org.apache.maven.plugin.PluginManager.attainGoals(PluginManager.java:671)
      at org.apache.maven.MavenSession.attainGoals(MavenSession.java:263)
      at org.apache.maven.cli.App.doMain(App.java:488)
      at org.apache.maven.cli.App.main(App.java:1239)
      at sun.reflect.NativeMethodAccessorImpl.invoke0(Native Method)
      at sun.reflect.NativeMethodAccessorImpl.invoke(NativeMethodAccessorImpl.java:39)
      at sun.reflect.DelegatingMethodAccessorImpl.invoke(DelegatingMethodAccessorImpl.java:25)
      at java.lang.reflect.Method.invoke(Method.java:324)
      at com.werken.forehead.Forehead.run(Forehead.java:551)
      at com.werken.forehead.Forehead.main(Forehead.java:581)
      Final Memory: 4M/8M
      Total time: 12 seconds
      Finished at: Fri Feb 25 17:03:28 CET 2005

      1. images.svg
        2 kB
        Lukas Theussl
      2. pdf-batik.patch
        6 kB
        Lukas Theussl
      3. test02.patch
        0.8 kB
        Lukas Theussl
      4. text.svg
        6 kB
        Lukas Theussl

        Activity

        Hide
        Arnaud Heritier added a comment -

        We must test if this can be a problem between batik 1.5 beta 4 (given in fop) and batik 1.5 (used in pdf plugin)

        Show
        Arnaud Heritier added a comment - We must test if this can be a problem between batik 1.5 beta 4 (given in fop) and batik 1.5 (used in pdf plugin)
        Hide
        Lukas Theussl added a comment -

        You were on the right track: I hadn't even noticed that the batik jars included in the fop distribution were not the final 1.5 ones (the jars in lib/ carry no version number!).
        I rebuilt the fop.jar from sources with the batik.jar in lib/ replaced by the batik-1.5 jars in my local maven repository.
        (For the record: the latest batik-1.6 release is incompatible with fop-0.20.5, you have to use 1.5 to build fop).
        With the resulting fop.jar in my local repository, the pdf goal goes through without error messages and SVG graphics included in the pdf file!

        Can I upload the fop.jar somewhere so that somebody else can test and confirm that?

        Show
        Lukas Theussl added a comment - You were on the right track: I hadn't even noticed that the batik jars included in the fop distribution were not the final 1.5 ones (the jars in lib/ carry no version number!). I rebuilt the fop.jar from sources with the batik.jar in lib/ replaced by the batik-1.5 jars in my local maven repository. (For the record: the latest batik-1.6 release is incompatible with fop-0.20.5, you have to use 1.5 to build fop). With the resulting fop.jar in my local repository, the pdf goal goes through without error messages and SVG graphics included in the pdf file! Can I upload the fop.jar somewhere so that somebody else can test and confirm that?
        Hide
        Arnaud Heritier added a comment -

        You can send it to me and I'll store it in my web account on apache.org.
        However we'll be stuck because we won't be able to deploy this jar on ibiblio and fop 0.20.5-beta4 isn't available on it also
        I'm waiting for the next fop release since several years and I despair to see it one day (In theory, it will solve several problems, and particularly dynamic size for columns in tables!!)

        Show
        Arnaud Heritier added a comment - You can send it to me and I'll store it in my web account on apache.org. However we'll be stuck because we won't be able to deploy this jar on ibiblio and fop 0.20.5-beta4 isn't available on it also I'm waiting for the next fop release since several years and I despair to see it one day (In theory, it will solve several problems, and particularly dynamic size for columns in tables!!)
        Hide
        Lukas Theussl added a comment -

        Problem solved most easily: there is already a batik-1.5-fop-0.20-5.jar on Ibiblio, which is identical to the batik-1.5beta4 that ships with fop. So I just rewrote the dependencies in project.xml and plugin.jelly such that the pdf goal uses this batik jar. Please test.

        Show
        Lukas Theussl added a comment - Problem solved most easily: there is already a batik-1.5-fop-0.20-5.jar on Ibiblio, which is identical to the batik-1.5beta4 that ships with fop. So I just rewrote the dependencies in project.xml and plugin.jelly such that the pdf goal uses this batik jar. Please test.
        Hide
        Lukas Theussl added a comment -

        Just realized that this batik-1.5-fop-0.20-5.jar was initially used by the pdf plugin, but was replaced by the official batik jars in CVS revision 114620 (http://svn.apache.org/viewcvs.cgi?rev=114620&view=rev).
        Does somebody remember the reason for that? I didn't notice any problem with using the fop version (on the contrary, it solves the above issue).

        Show
        Lukas Theussl added a comment - Just realized that this batik-1.5-fop-0.20-5.jar was initially used by the pdf plugin, but was replaced by the official batik jars in CVS revision 114620 ( http://svn.apache.org/viewcvs.cgi?rev=114620&view=rev ). Does somebody remember the reason for that? I didn't notice any problem with using the fop version (on the contrary, it solves the above issue).
        Hide
        Arnaud Heritier added a comment -

        Now you say it I remember that it was me who provided this patch
        I wasn't committer and it was Emanuel who did it.
        I also asked to published the special batik jar
        I upgraded this library only to have an official one.
        Someone tested it but it seems that it wasn't enough.
        What I propose, is that we add an SVG in the pdf generated by the tests to reproduce this bug.
        Then we'll downgrade the batik library to fix the bug.
        Do you have a svg file that fails ? I think I tested with some svg coming from the fop distribution and it worked.

        Show
        Arnaud Heritier added a comment - Now you say it I remember that it was me who provided this patch I wasn't committer and it was Emanuel who did it. I also asked to published the special batik jar I upgraded this library only to have an official one. Someone tested it but it seems that it wasn't enough. What I propose, is that we add an SVG in the pdf generated by the tests to reproduce this bug. Then we'll downgrade the batik library to fix the bug. Do you have a svg file that fails ? I think I tested with some svg coming from the fop distribution and it worked.
        Hide
        Lukas Theussl added a comment -

        Attached a patch to test the SVG support. I just added one section in test02/test.xml that includes two svg
        files (they go into src/plugin-test/test02/xdocs/images/, I got them from the fop web site).
        With the current pdf plugin from SVN, the plugin:test goal fails
        with the exact error message as reported above, with my former patch applied everything works ok.

        Show
        Lukas Theussl added a comment - Attached a patch to test the SVG support. I just added one section in test02/test.xml that includes two svg files (they go into src/plugin-test/test02/xdocs/images/, I got them from the fop web site). With the current pdf plugin from SVN, the plugin:test goal fails with the exact error message as reported above, with my former patch applied everything works ok.
        Hide
        Arnaud Heritier added a comment -

        Patchs applied. Thanks.

        Show
        Arnaud Heritier added a comment - Patchs applied. Thanks.

          People

          • Assignee:
            Arnaud Heritier
            Reporter:
            Valerie Nyre
          • Votes:
            0 Vote for this issue
            Watchers:
            1 Start watching this issue

            Dates

            • Created:
              Updated:
              Resolved: