Maven PDF Plugin
  1. Maven PDF Plugin
  2. MPDF-51

NoSuchMethodError while calling Maven PDF Plugin via CLI

    Details

    • Type: Bug Bug
    • Status: Closed Closed
    • Priority: Major Major
    • Resolution: Duplicate
    • Affects Version/s: 1.1
    • Fix Version/s: None
    • Labels:
      None
    • Environment:
    • Number of attachments :
      0

      Description

      Just called mvn pdf:pdf from the root directory of my Maven project which results into the following failure:

      kama@office:~/ws-git/maui$ mvn pdf:pdf | tee pdf.log
      [INFO] Scanning for projects...
      [INFO]                                                                         
      [INFO] ------------------------------------------------------------------------
      [INFO] Building MaUI Test Guide 0.1-SNAPSHOT
      [INFO] ------------------------------------------------------------------------
      [INFO] 
      [INFO] --- maven-pdf-plugin:1.1:pdf (default-cli) @ maui ---
      [INFO] ------------------------------------------------------------------------
      [INFO] BUILD FAILURE
      [INFO] ------------------------------------------------------------------------
      [INFO] Total time: 4.546s
      [INFO] Finished at: Mon May 30 20:17:00 CEST 2011
      [INFO] Final Memory: 13M/144M
      [INFO] ------------------------------------------------------------------------
      [ERROR] Failed to execute goal org.apache.maven.plugins:maven-pdf-plugin:1.1:pdf (default-cli) on project maui: Execution default-cli of goal org.apache.maven.plugins:maven-pdf-plugin:1.1:pdf failed: An API incompatibility was encountered while executing org.apache.maven.plugins:maven-pdf-plugin:1.1:pdf: java.lang.NoSuchMethodError: org.apache.maven.plugin.PluginManager.verifyReportPlugin(Lorg/apache/maven/model/ReportPlugin;Lorg/apache/maven/project/MavenProject;Lorg/apache/maven/execution/MavenSession;)Lorg/apache/maven/plugin/descriptor/PluginDescriptor;
      [ERROR] -----------------------------------------------------
      [ERROR] realm =    plugin>org.apache.maven.plugins:maven-pdf-plugin:1.1
      [ERROR] strategy = org.codehaus.plexus.classworlds.strategy.SelfFirstStrategy
      [ERROR] urls[0] = file:/home/kama/.m2/repository/org/apache/maven/plugins/maven-pdf-plugin/1.1/maven-pdf-plugin-1.1.jar
      [ERROR] urls[1] = file:/home/kama/.m2/repository/commons-cli/commons-cli/1.0/commons-cli-1.0.jar
      [ERROR] urls[2] = file:/home/kama/.m2/repository/org/codehaus/plexus/plexus-interactivity-api/1.0-alpha-4/plexus-interactivity-api-1.0-alpha-4.jar
      [ERROR] urls[3] = file:/home/kama/.m2/repository/org/apache/maven/reporting/maven-reporting-api/2.0.9/maven-reporting-api-2.0.9.jar
      [ERROR] urls[4] = file:/home/kama/.m2/repository/org/apache/maven/reporting/maven-reporting-impl/2.0.4.3/maven-reporting-impl-2.0.4.3.jar
      [ERROR] urls[5] = file:/home/kama/.m2/repository/commons-validator/commons-validator/1.2.0/commons-validator-1.2.0.jar
      [ERROR] urls[6] = file:/home/kama/.m2/repository/commons-beanutils/commons-beanutils/1.7.0/commons-beanutils-1.7.0.jar
      [ERROR] urls[7] = file:/home/kama/.m2/repository/commons-digester/commons-digester/1.6/commons-digester-1.6.jar
      [ERROR] urls[8] = file:/home/kama/.m2/repository/oro/oro/2.0.8/oro-2.0.8.jar
      [ERROR] urls[9] = file:/home/kama/.m2/repository/org/apache/maven/shared/maven-doxia-tools/1.1/maven-doxia-tools-1.1.jar
      [ERROR] urls[10] = file:/home/kama/.m2/repository/commons-io/commons-io/1.4/commons-io-1.4.jar
      [ERROR] urls[11] = file:/home/kama/.m2/repository/org/apache/maven/doxia/doxia-logging-api/1.1.1/doxia-logging-api-1.1.1.jar
      [ERROR] urls[12] = file:/home/kama/.m2/repository/org/apache/maven/doxia/doxia-sink-api/1.1.2/doxia-sink-api-1.1.2.jar
      [ERROR] urls[13] = file:/home/kama/.m2/repository/org/apache/maven/doxia/doxia-module-xdoc/1.1.2/doxia-module-xdoc-1.1.2.jar
      [ERROR] urls[14] = file:/home/kama/.m2/repository/org/apache/maven/doxia/doxia-core/1.1.2/doxia-core-1.1.2.jar
      [ERROR] urls[15] = file:/home/kama/.m2/repository/xerces/xercesImpl/2.8.1/xercesImpl-2.8.1.jar
      [ERROR] urls[16] = file:/home/kama/.m2/repository/commons-lang/commons-lang/2.4/commons-lang-2.4.jar
      [ERROR] urls[17] = file:/home/kama/.m2/repository/commons-httpclient/commons-httpclient/3.1/commons-httpclient-3.1.jar
      [ERROR] urls[18] = file:/home/kama/.m2/repository/commons-codec/commons-codec/1.2/commons-codec-1.2.jar
      [ERROR] urls[19] = file:/home/kama/.m2/repository/org/apache/maven/doxia/doxia-doc-renderer/1.1.2/doxia-doc-renderer-1.1.2.jar
      [ERROR] urls[20] = file:/home/kama/.m2/repository/org/apache/maven/doxia/doxia-module-itext/1.1.2/doxia-module-itext-1.1.2.jar
      [ERROR] urls[21] = file:/home/kama/.m2/repository/org/apache/maven/doxia/doxia-module-fo/1.1.2/doxia-module-fo-1.1.2.jar
      [ERROR] urls[22] = file:/home/kama/.m2/repository/commons-configuration/commons-configuration/1.6/commons-configuration-1.6.jar
      [ERROR] urls[23] = file:/home/kama/.m2/repository/commons-beanutils/commons-beanutils-core/1.8.0/commons-beanutils-core-1.8.0.jar
      [ERROR] urls[24] = file:/home/kama/.m2/repository/org/apache/xmlgraphics/fop/0.95/fop-0.95.jar
      [ERROR] urls[25] = file:/home/kama/.m2/repository/org/apache/xmlgraphics/xmlgraphics-commons/1.3.1/xmlgraphics-commons-1.3.1.jar
      [ERROR] urls[26] = file:/home/kama/.m2/repository/org/apache/xmlgraphics/batik-svg-dom/1.7/batik-svg-dom-1.7.jar
      [ERROR] urls[27] = file:/home/kama/.m2/repository/org/apache/xmlgraphics/batik-anim/1.7/batik-anim-1.7.jar
      [ERROR] urls[28] = file:/home/kama/.m2/repository/org/apache/xmlgraphics/batik-css/1.7/batik-css-1.7.jar
      [ERROR] urls[29] = file:/home/kama/.m2/repository/org/apache/xmlgraphics/batik-dom/1.7/batik-dom-1.7.jar
      [ERROR] urls[30] = file:/home/kama/.m2/repository/org/apache/xmlgraphics/batik-parser/1.7/batik-parser-1.7.jar
      [ERROR] urls[31] = file:/home/kama/.m2/repository/org/apache/xmlgraphics/batik-util/1.7/batik-util-1.7.jar
      [ERROR] urls[32] = file:/home/kama/.m2/repository/xml-apis/xml-apis-ext/1.3.04/xml-apis-ext-1.3.04.jar
      [ERROR] urls[33] = file:/home/kama/.m2/repository/org/apache/xmlgraphics/batik-bridge/1.7/batik-bridge-1.7.jar
      [ERROR] urls[34] = file:/home/kama/.m2/repository/org/apache/xmlgraphics/batik-script/1.7/batik-script-1.7.jar
      [ERROR] urls[35] = file:/home/kama/.m2/repository/org/apache/xmlgraphics/batik-js/1.7/batik-js-1.7.jar
      [ERROR] urls[36] = file:/home/kama/.m2/repository/org/apache/xmlgraphics/batik-xml/1.7/batik-xml-1.7.jar
      [ERROR] urls[37] = file:/home/kama/.m2/repository/org/apache/xmlgraphics/batik-awt-util/1.7/batik-awt-util-1.7.jar
      [ERROR] urls[38] = file:/home/kama/.m2/repository/org/apache/xmlgraphics/batik-gvt/1.7/batik-gvt-1.7.jar
      [ERROR] urls[39] = file:/home/kama/.m2/repository/org/apache/xmlgraphics/batik-transcoder/1.7/batik-transcoder-1.7.jar
      [ERROR] urls[40] = file:/home/kama/.m2/repository/org/apache/xmlgraphics/batik-svggen/1.7/batik-svggen-1.7.jar
      [ERROR] urls[41] = file:/home/kama/.m2/repository/org/apache/xmlgraphics/batik-extension/1.7/batik-extension-1.7.jar
      [ERROR] urls[42] = file:/home/kama/.m2/repository/org/apache/xmlgraphics/batik-ext/1.7/batik-ext-1.7.jar
      [ERROR] urls[43] = file:/home/kama/.m2/repository/org/apache/avalon/framework/avalon-framework-api/4.3.1/avalon-framework-api-4.3.1.jar
      [ERROR] urls[44] = file:/home/kama/.m2/repository/log4j/log4j/1.2.12/log4j-1.2.12.jar
      [ERROR] urls[45] = file:/home/kama/.m2/repository/org/apache/maven/doxia/doxia-module-apt/1.1.2/doxia-module-apt-1.1.2.jar
      [ERROR] urls[46] = file:/home/kama/.m2/repository/org/apache/maven/doxia/doxia-module-fml/1.1.2/doxia-module-fml-1.1.2.jar
      [ERROR] urls[47] = file:/home/kama/.m2/repository/org/apache/maven/doxia/doxia-module-xhtml/1.1.2/doxia-module-xhtml-1.1.2.jar
      [ERROR] urls[48] = file:/home/kama/.m2/repository/org/codehaus/plexus/plexus-velocity/1.1.7/plexus-velocity-1.1.7.jar
      [ERROR] urls[49] = file:/home/kama/.m2/repository/org/apache/velocity/velocity/1.6.2/velocity-1.6.2.jar
      [ERROR] urls[50] = file:/home/kama/.m2/repository/commons-collections/commons-collections/3.2.1/commons-collections-3.2.1.jar
      [ERROR] urls[51] = file:/home/kama/.m2/repository/com/lowagie/itext/1.4/itext-1.4.jar
      [ERROR] urls[52] = file:/home/kama/.m2/repository/xalan/xalan/2.7.0/xalan-2.7.0.jar
      [ERROR] urls[53] = file:/home/kama/.m2/repository/xml-apis/xml-apis/1.3.04/xml-apis-1.3.04.jar
      [ERROR] urls[54] = file:/home/kama/.m2/repository/org/apache/maven/doxia/doxia-decoration-model/1.1.2/doxia-decoration-model-1.1.2.jar
      [ERROR] urls[55] = file:/home/kama/.m2/repository/org/apache/maven/doxia/doxia-site-renderer/1.1.2/doxia-site-renderer-1.1.2.jar
      [ERROR] urls[56] = file:/home/kama/.m2/repository/org/codehaus/plexus/plexus-utils/1.5.7/plexus-utils-1.5.7.jar
      [ERROR] urls[57] = file:/home/kama/.m2/repository/org/codehaus/plexus/plexus-interpolation/1.7/plexus-interpolation-1.7.jar
      [ERROR] urls[58] = file:/home/kama/.m2/repository/org/codehaus/plexus/plexus-i18n/1.0-beta-7/plexus-i18n-1.0-beta-7.jar
      [ERROR] urls[59] = file:/home/kama/.m2/repository/junit/junit/3.8.1/junit-3.8.1.jar
      [ERROR] urls[60] = file:/home/kama/.m2/repository/commons-logging/commons-logging/1.1.1/commons-logging-1.1.1.jar
      [ERROR] Number of foreign imports: 1
      [ERROR] import: Entry[import  from realm ClassRealm[project>com.soebes.maven.guide:maui:0.1-SNAPSHOT, parent: ClassRealm[maven.api, parent: null]]]
      [ERROR] 
      [ERROR] -----------------------------------------------------
      [ERROR] -> [Help 1]
      [ERROR] 
      [ERROR] To see the full stack trace of the errors, re-run Maven with the -e switch.
      [ERROR] Re-run Maven using the -X switch to enable full debug logging.
      [ERROR] 
      [ERROR] For more information about the errors and possible solutions, please read the following articles:
      kama@office:~/ws-git/maui$ ki.apache.org/confluence/display/MAVEN/PluginContainerException
      

        Issue Links

          Activity

          Hide
          Karl-Heinz Marbaise added a comment -

          Tested the plugin as well via configuration from within the pom of the same project:

          kama@office:~/ws-git/maui$ mvn clean site
          [INFO] Scanning for projects...
          [INFO]                                                                         
          [INFO] ------------------------------------------------------------------------
          [INFO] Building MaUI Test Guide 0.1-SNAPSHOT
          [INFO] ------------------------------------------------------------------------
          [INFO] 
          [INFO] --- maven-clean-plugin:2.4.1:clean (default-clean) @ maui ---
          [INFO] Deleting /home/kama/ws-git/maui/target
          [INFO] 
          [INFO] --- maven-assembly-plugin:2.2:single (make-assembly) @ maui ---
          [INFO] Reading assembly descriptor: /home/kama/ws-git/maui/src.xml
          [INFO] Building zip: /home/kama/ws-git/maui/target/maui-0.1-SNAPSHOT-src.zip
          [INFO] Building tar : /home/kama/ws-git/maui/target/maui-0.1-SNAPSHOT-src.tar.gz
          [INFO] Building tar : /home/kama/ws-git/maui/target/maui-0.1-SNAPSHOT-src.tar.bz2
          [INFO] 
          [INFO] --- doxia-maven-plugin:1.1.4:render-books (default) @ maui ---
          [INFO] 
          [INFO] --- maven-site-plugin:3.0-beta-3:site (default-site) @ maui ---
          [INFO] configuring report plugin org.apache.maven.plugins:maven-changes-plugin:2.4
          [INFO] configuring report plugin org.apache.maven.plugins:maven-site-plugin:3.0-beta-3
          [INFO] configuring report plugin org.apache.maven.plugins:maven-project-info-reports-plugin:2.3.1
          [INFO] Rendering site with org.apache.maven.skins:maven-default-skin:jar:1.0 skin.
          [INFO] Skipped "About" report, file "index.html" already exists for the English version.
          [INFO] Generating "Changes Report" report    --- maven-changes-plugin:2.4
          [INFO] Generating "Continuous Integration" report    --- maven-project-info-reports-plugin:2.3.1
          [INFO] Generating "Dependencies" report    --- maven-project-info-reports-plugin:2.3.1
          [INFO] Generating "Distribution Management" report    --- maven-project-info-reports-plugin:2.3.1
          [INFO] Generating "Issue Tracking" report    --- maven-project-info-reports-plugin:2.3.1
          [INFO] Generating "Project License" report    --- maven-project-info-reports-plugin:2.3.1
          [INFO] Generating "Mailing Lists" report    --- maven-project-info-reports-plugin:2.3.1
          [INFO] Generating "Plugin Management" report    --- maven-project-info-reports-plugin:2.3.1
          [INFO] Generating "Project Plugins" report    --- maven-project-info-reports-plugin:2.3.1
          [INFO] Generating "Project Team" report    --- maven-project-info-reports-plugin:2.3.1
          [INFO] Generating "Source Repository" report    --- maven-project-info-reports-plugin:2.3.1
          [INFO] Generating "Project Summary" report    --- maven-project-info-reports-plugin:2.3.1
          [INFO] 
          [INFO] --- maven-dependency-plugin:2.2:copy (copy) @ maui ---
          [INFO] Configured Artifact: com.soebes.maven.guide:maui:src:0.1-SNAPSHOT:tar.gz
          [INFO] Configured Artifact: com.soebes.maven.guide:maui:src:0.1-SNAPSHOT:tar.bz2
          [INFO] Configured Artifact: com.soebes.maven.guide:maui:src:0.1-SNAPSHOT:zip
          [INFO] Copying maui-0.1-SNAPSHOT-src.tar.gz to /home/kama/ws-git/maui/target/site/maui-0.1-SNAPSHOT-src.tar.gz
          [INFO] Copying maui-0.1-SNAPSHOT-src.tar.bz2 to /home/kama/ws-git/maui/target/site/maui-0.1-SNAPSHOT-src.tar.bz2
          [INFO] Copying maui-0.1-SNAPSHOT-src.zip to /home/kama/ws-git/maui/target/site/maui-0.1-SNAPSHOT-src.zip
          [INFO] 
          [INFO] --- maven-pdf-plugin:1.1:pdf (pdf) @ maui ---
          [INFO] ------------------------------------------------------------------------
          [INFO] BUILD FAILURE
          [INFO] ------------------------------------------------------------------------
          [INFO] Total time: 21.127s
          [INFO] Finished at: Mon May 30 20:25:05 CEST 2011
          [INFO] Final Memory: 24M/306M
          [INFO] ------------------------------------------------------------------------
          [ERROR] Failed to execute goal org.apache.maven.plugins:maven-pdf-plugin:1.1:pdf (pdf) on project maui: Execution pdf of goal org.apache.maven.plugins:maven-pdf-plugin:1.1:pdf failed: An API incompatibility was encountered while executing org.apache.maven.plugins:maven-pdf-plugin:1.1:pdf: java.lang.NoSuchMethodError: org.apache.maven.plugin.PluginManager.verifyReportPlugin(Lorg/apache/maven/model/ReportPlugin;Lorg/apache/maven/project/MavenProject;Lorg/apache/maven/execution/MavenSession;)Lorg/apache/maven/plugin/descriptor/PluginDescriptor;
          [ERROR] -----------------------------------------------------
          [ERROR] realm =    plugin>org.apache.maven.plugins:maven-pdf-plugin:1.1
          [ERROR] strategy = org.codehaus.plexus.classworlds.strategy.SelfFirstStrategy
          [ERROR] urls[0] = file:/home/kama/.m2/repository/org/apache/maven/plugins/maven-pdf-plugin/1.1/maven-pdf-plugin-1.1.jar
          [ERROR] urls[1] = file:/home/kama/.m2/repository/commons-cli/commons-cli/1.0/commons-cli-1.0.jar
          [ERROR] urls[2] = file:/home/kama/.m2/repository/org/codehaus/plexus/plexus-interactivity-api/1.0-alpha-4/plexus-interactivity-api-1.0-alpha-4.jar
          [ERROR] urls[3] = file:/home/kama/.m2/repository/org/apache/maven/reporting/maven-reporting-api/2.0.9/maven-reporting-api-2.0.9.jar
          [ERROR] urls[4] = file:/home/kama/.m2/repository/org/apache/maven/reporting/maven-reporting-impl/2.0.4.3/maven-reporting-impl-2.0.4.3.jar
          [ERROR] urls[5] = file:/home/kama/.m2/repository/commons-validator/commons-validator/1.2.0/commons-validator-1.2.0.jar
          [ERROR] urls[6] = file:/home/kama/.m2/repository/commons-beanutils/commons-beanutils/1.7.0/commons-beanutils-1.7.0.jar
          [ERROR] urls[7] = file:/home/kama/.m2/repository/commons-digester/commons-digester/1.6/commons-digester-1.6.jar
          [ERROR] urls[8] = file:/home/kama/.m2/repository/oro/oro/2.0.8/oro-2.0.8.jar
          [ERROR] urls[9] = file:/home/kama/.m2/repository/org/apache/maven/shared/maven-doxia-tools/1.1/maven-doxia-tools-1.1.jar
          [ERROR] urls[10] = file:/home/kama/.m2/repository/commons-io/commons-io/1.4/commons-io-1.4.jar
          [ERROR] urls[11] = file:/home/kama/.m2/repository/org/apache/maven/doxia/doxia-logging-api/1.1.1/doxia-logging-api-1.1.1.jar
          [ERROR] urls[12] = file:/home/kama/.m2/repository/org/apache/maven/doxia/doxia-sink-api/1.1.2/doxia-sink-api-1.1.2.jar
          [ERROR] urls[13] = file:/home/kama/.m2/repository/org/apache/maven/doxia/doxia-module-xdoc/1.1.2/doxia-module-xdoc-1.1.2.jar
          [ERROR] urls[14] = file:/home/kama/.m2/repository/org/apache/maven/doxia/doxia-core/1.1.2/doxia-core-1.1.2.jar
          [ERROR] urls[15] = file:/home/kama/.m2/repository/xerces/xercesImpl/2.8.1/xercesImpl-2.8.1.jar
          [ERROR] urls[16] = file:/home/kama/.m2/repository/commons-lang/commons-lang/2.4/commons-lang-2.4.jar
          [ERROR] urls[17] = file:/home/kama/.m2/repository/commons-httpclient/commons-httpclient/3.1/commons-httpclient-3.1.jar
          [ERROR] urls[18] = file:/home/kama/.m2/repository/commons-codec/commons-codec/1.2/commons-codec-1.2.jar
          [ERROR] urls[19] = file:/home/kama/.m2/repository/org/apache/maven/doxia/doxia-doc-renderer/1.1.2/doxia-doc-renderer-1.1.2.jar
          [ERROR] urls[20] = file:/home/kama/.m2/repository/org/apache/maven/doxia/doxia-module-itext/1.1.2/doxia-module-itext-1.1.2.jar
          [ERROR] urls[21] = file:/home/kama/.m2/repository/org/apache/maven/doxia/doxia-module-fo/1.1.2/doxia-module-fo-1.1.2.jar
          [ERROR] urls[22] = file:/home/kama/.m2/repository/commons-configuration/commons-configuration/1.6/commons-configuration-1.6.jar
          [ERROR] urls[23] = file:/home/kama/.m2/repository/commons-beanutils/commons-beanutils-core/1.8.0/commons-beanutils-core-1.8.0.jar
          [ERROR] urls[24] = file:/home/kama/.m2/repository/org/apache/xmlgraphics/fop/0.95/fop-0.95.jar
          [ERROR] urls[25] = file:/home/kama/.m2/repository/org/apache/xmlgraphics/xmlgraphics-commons/1.3.1/xmlgraphics-commons-1.3.1.jar
          [ERROR] urls[26] = file:/home/kama/.m2/repository/org/apache/xmlgraphics/batik-svg-dom/1.7/batik-svg-dom-1.7.jar
          [ERROR] urls[27] = file:/home/kama/.m2/repository/org/apache/xmlgraphics/batik-anim/1.7/batik-anim-1.7.jar
          [ERROR] urls[28] = file:/home/kama/.m2/repository/org/apache/xmlgraphics/batik-css/1.7/batik-css-1.7.jar
          [ERROR] urls[29] = file:/home/kama/.m2/repository/org/apache/xmlgraphics/batik-dom/1.7/batik-dom-1.7.jar
          [ERROR] urls[30] = file:/home/kama/.m2/repository/org/apache/xmlgraphics/batik-parser/1.7/batik-parser-1.7.jar
          [ERROR] urls[31] = file:/home/kama/.m2/repository/org/apache/xmlgraphics/batik-util/1.7/batik-util-1.7.jar
          [ERROR] urls[32] = file:/home/kama/.m2/repository/xml-apis/xml-apis-ext/1.3.04/xml-apis-ext-1.3.04.jar
          [ERROR] urls[33] = file:/home/kama/.m2/repository/org/apache/xmlgraphics/batik-bridge/1.7/batik-bridge-1.7.jar
          [ERROR] urls[34] = file:/home/kama/.m2/repository/org/apache/xmlgraphics/batik-script/1.7/batik-script-1.7.jar
          [ERROR] urls[35] = file:/home/kama/.m2/repository/org/apache/xmlgraphics/batik-js/1.7/batik-js-1.7.jar
          [ERROR] urls[36] = file:/home/kama/.m2/repository/org/apache/xmlgraphics/batik-xml/1.7/batik-xml-1.7.jar
          [ERROR] urls[37] = file:/home/kama/.m2/repository/org/apache/xmlgraphics/batik-awt-util/1.7/batik-awt-util-1.7.jar
          [ERROR] urls[38] = file:/home/kama/.m2/repository/org/apache/xmlgraphics/batik-gvt/1.7/batik-gvt-1.7.jar
          [ERROR] urls[39] = file:/home/kama/.m2/repository/org/apache/xmlgraphics/batik-transcoder/1.7/batik-transcoder-1.7.jar
          [ERROR] urls[40] = file:/home/kama/.m2/repository/org/apache/xmlgraphics/batik-svggen/1.7/batik-svggen-1.7.jar
          [ERROR] urls[41] = file:/home/kama/.m2/repository/org/apache/xmlgraphics/batik-extension/1.7/batik-extension-1.7.jar
          [ERROR] urls[42] = file:/home/kama/.m2/repository/org/apache/xmlgraphics/batik-ext/1.7/batik-ext-1.7.jar
          [ERROR] urls[43] = file:/home/kama/.m2/repository/org/apache/avalon/framework/avalon-framework-api/4.3.1/avalon-framework-api-4.3.1.jar
          [ERROR] urls[44] = file:/home/kama/.m2/repository/log4j/log4j/1.2.12/log4j-1.2.12.jar
          [ERROR] urls[45] = file:/home/kama/.m2/repository/org/apache/maven/doxia/doxia-module-apt/1.1.2/doxia-module-apt-1.1.2.jar
          [ERROR] urls[46] = file:/home/kama/.m2/repository/org/apache/maven/doxia/doxia-module-fml/1.1.2/doxia-module-fml-1.1.2.jar
          [ERROR] urls[47] = file:/home/kama/.m2/repository/org/apache/maven/doxia/doxia-module-xhtml/1.1.2/doxia-module-xhtml-1.1.2.jar
          [ERROR] urls[48] = file:/home/kama/.m2/repository/org/codehaus/plexus/plexus-velocity/1.1.7/plexus-velocity-1.1.7.jar
          [ERROR] urls[49] = file:/home/kama/.m2/repository/org/apache/velocity/velocity/1.6.2/velocity-1.6.2.jar
          [ERROR] urls[50] = file:/home/kama/.m2/repository/commons-collections/commons-collections/3.2.1/commons-collections-3.2.1.jar
          [ERROR] urls[51] = file:/home/kama/.m2/repository/com/lowagie/itext/1.4/itext-1.4.jar
          [ERROR] urls[52] = file:/home/kama/.m2/repository/xalan/xalan/2.7.0/xalan-2.7.0.jar
          [ERROR] urls[53] = file:/home/kama/.m2/repository/xml-apis/xml-apis/1.3.04/xml-apis-1.3.04.jar
          [ERROR] urls[54] = file:/home/kama/.m2/repository/org/apache/maven/doxia/doxia-decoration-model/1.1.2/doxia-decoration-model-1.1.2.jar
          [ERROR] urls[55] = file:/home/kama/.m2/repository/org/apache/maven/doxia/doxia-site-renderer/1.1.2/doxia-site-renderer-1.1.2.jar
          [ERROR] urls[56] = file:/home/kama/.m2/repository/org/codehaus/plexus/plexus-utils/1.5.7/plexus-utils-1.5.7.jar
          [ERROR] urls[57] = file:/home/kama/.m2/repository/org/codehaus/plexus/plexus-interpolation/1.7/plexus-interpolation-1.7.jar
          [ERROR] urls[58] = file:/home/kama/.m2/repository/org/codehaus/plexus/plexus-i18n/1.0-beta-7/plexus-i18n-1.0-beta-7.jar
          [ERROR] urls[59] = file:/home/kama/.m2/repository/junit/junit/3.8.1/junit-3.8.1.jar
          [ERROR] urls[60] = file:/home/kama/.m2/repository/commons-logging/commons-logging/1.1.1/commons-logging-1.1.1.jar
          [ERROR] Number of foreign imports: 1
          [ERROR] import: Entry[import  from realm ClassRealm[project>com.soebes.maven.guide:maui:0.1-SNAPSHOT, parent: ClassRealm[maven.api, parent: null]]]
          [ERROR] 
          [ERROR] -----------------------------------------------------
          [ERROR] -> [Help 1]
          [ERROR] 
          [ERROR] To see the full stack trace of the errors, re-run Maven with the -e switch.
          [ERROR] Re-run Maven using the -X switch to enable full debug logging.
          [ERROR] 
          [ERROR] For more information about the errors and possible solutions, please read the following articles:
          [ERROR] [Help 1] http://cwiki.apache.org/confluence/display/MAVEN/PluginContainerException
          kama@office:~/ws-git/maui$ 
          

          The full project can be found here: https://github.com/khmarbaise/maui
          I used the pom snippet from the project web-site (http://maven.apache.org/plugins/maven-pdf-plugin/usage.html)

          Show
          Karl-Heinz Marbaise added a comment - Tested the plugin as well via configuration from within the pom of the same project: kama@office:~/ws-git/maui$ mvn clean site [INFO] Scanning for projects... [INFO] [INFO] ------------------------------------------------------------------------ [INFO] Building MaUI Test Guide 0.1-SNAPSHOT [INFO] ------------------------------------------------------------------------ [INFO] [INFO] --- maven-clean-plugin:2.4.1:clean ( default -clean) @ maui --- [INFO] Deleting /home/kama/ws-git/maui/target [INFO] [INFO] --- maven-assembly-plugin:2.2:single (make-assembly) @ maui --- [INFO] Reading assembly descriptor: /home/kama/ws-git/maui/src.xml [INFO] Building zip: /home/kama/ws-git/maui/target/maui-0.1-SNAPSHOT-src.zip [INFO] Building tar : /home/kama/ws-git/maui/target/maui-0.1-SNAPSHOT-src.tar.gz [INFO] Building tar : /home/kama/ws-git/maui/target/maui-0.1-SNAPSHOT-src.tar.bz2 [INFO] [INFO] --- doxia-maven-plugin:1.1.4:render-books ( default ) @ maui --- [INFO] [INFO] --- maven-site-plugin:3.0-beta-3:site ( default -site) @ maui --- [INFO] configuring report plugin org.apache.maven.plugins:maven-changes-plugin:2.4 [INFO] configuring report plugin org.apache.maven.plugins:maven-site-plugin:3.0-beta-3 [INFO] configuring report plugin org.apache.maven.plugins:maven-project-info-reports-plugin:2.3.1 [INFO] Rendering site with org.apache.maven.skins:maven- default -skin:jar:1.0 skin. [INFO] Skipped "About" report, file "index.html" already exists for the English version. [INFO] Generating "Changes Report" report --- maven-changes-plugin:2.4 [INFO] Generating "Continuous Integration" report --- maven-project-info-reports-plugin:2.3.1 [INFO] Generating "Dependencies" report --- maven-project-info-reports-plugin:2.3.1 [INFO] Generating "Distribution Management" report --- maven-project-info-reports-plugin:2.3.1 [INFO] Generating "Issue Tracking" report --- maven-project-info-reports-plugin:2.3.1 [INFO] Generating "Project License" report --- maven-project-info-reports-plugin:2.3.1 [INFO] Generating "Mailing Lists" report --- maven-project-info-reports-plugin:2.3.1 [INFO] Generating "Plugin Management" report --- maven-project-info-reports-plugin:2.3.1 [INFO] Generating "Project Plugins" report --- maven-project-info-reports-plugin:2.3.1 [INFO] Generating "Project Team" report --- maven-project-info-reports-plugin:2.3.1 [INFO] Generating "Source Repository" report --- maven-project-info-reports-plugin:2.3.1 [INFO] Generating "Project Summary" report --- maven-project-info-reports-plugin:2.3.1 [INFO] [INFO] --- maven-dependency-plugin:2.2:copy (copy) @ maui --- [INFO] Configured Artifact: com.soebes.maven.guide:maui:src:0.1-SNAPSHOT:tar.gz [INFO] Configured Artifact: com.soebes.maven.guide:maui:src:0.1-SNAPSHOT:tar.bz2 [INFO] Configured Artifact: com.soebes.maven.guide:maui:src:0.1-SNAPSHOT:zip [INFO] Copying maui-0.1-SNAPSHOT-src.tar.gz to /home/kama/ws-git/maui/target/site/maui-0.1-SNAPSHOT-src.tar.gz [INFO] Copying maui-0.1-SNAPSHOT-src.tar.bz2 to /home/kama/ws-git/maui/target/site/maui-0.1-SNAPSHOT-src.tar.bz2 [INFO] Copying maui-0.1-SNAPSHOT-src.zip to /home/kama/ws-git/maui/target/site/maui-0.1-SNAPSHOT-src.zip [INFO] [INFO] --- maven-pdf-plugin:1.1:pdf (pdf) @ maui --- [INFO] ------------------------------------------------------------------------ [INFO] BUILD FAILURE [INFO] ------------------------------------------------------------------------ [INFO] Total time: 21.127s [INFO] Finished at: Mon May 30 20:25:05 CEST 2011 [INFO] Final Memory: 24M/306M [INFO] ------------------------------------------------------------------------ [ERROR] Failed to execute goal org.apache.maven.plugins:maven-pdf-plugin:1.1:pdf (pdf) on project maui: Execution pdf of goal org.apache.maven.plugins:maven-pdf-plugin:1.1:pdf failed: An API incompatibility was encountered while executing org.apache.maven.plugins:maven-pdf-plugin:1.1:pdf: java.lang.NoSuchMethodError: org.apache.maven.plugin.PluginManager.verifyReportPlugin(Lorg/apache/maven/model/ReportPlugin;Lorg/apache/maven/project/MavenProject;Lorg/apache/maven/execution/MavenSession;)Lorg/apache/maven/plugin/descriptor/PluginDescriptor; [ERROR] ----------------------------------------------------- [ERROR] realm = plugin>org.apache.maven.plugins:maven-pdf-plugin:1.1 [ERROR] strategy = org.codehaus.plexus.classworlds.strategy.SelfFirstStrategy [ERROR] urls[0] = file:/home/kama/.m2/repository/org/apache/maven/plugins/maven-pdf-plugin/1.1/maven-pdf-plugin-1.1.jar [ERROR] urls[1] = file:/home/kama/.m2/repository/commons-cli/commons-cli/1.0/commons-cli-1.0.jar [ERROR] urls[2] = file:/home/kama/.m2/repository/org/codehaus/plexus/plexus-interactivity-api/1.0-alpha-4/plexus-interactivity-api-1.0-alpha-4.jar [ERROR] urls[3] = file:/home/kama/.m2/repository/org/apache/maven/reporting/maven-reporting-api/2.0.9/maven-reporting-api-2.0.9.jar [ERROR] urls[4] = file:/home/kama/.m2/repository/org/apache/maven/reporting/maven-reporting-impl/2.0.4.3/maven-reporting-impl-2.0.4.3.jar [ERROR] urls[5] = file:/home/kama/.m2/repository/commons-validator/commons-validator/1.2.0/commons-validator-1.2.0.jar [ERROR] urls[6] = file:/home/kama/.m2/repository/commons-beanutils/commons-beanutils/1.7.0/commons-beanutils-1.7.0.jar [ERROR] urls[7] = file:/home/kama/.m2/repository/commons-digester/commons-digester/1.6/commons-digester-1.6.jar [ERROR] urls[8] = file:/home/kama/.m2/repository/oro/oro/2.0.8/oro-2.0.8.jar [ERROR] urls[9] = file:/home/kama/.m2/repository/org/apache/maven/shared/maven-doxia-tools/1.1/maven-doxia-tools-1.1.jar [ERROR] urls[10] = file:/home/kama/.m2/repository/commons-io/commons-io/1.4/commons-io-1.4.jar [ERROR] urls[11] = file:/home/kama/.m2/repository/org/apache/maven/doxia/doxia-logging-api/1.1.1/doxia-logging-api-1.1.1.jar [ERROR] urls[12] = file:/home/kama/.m2/repository/org/apache/maven/doxia/doxia-sink-api/1.1.2/doxia-sink-api-1.1.2.jar [ERROR] urls[13] = file:/home/kama/.m2/repository/org/apache/maven/doxia/doxia-module-xdoc/1.1.2/doxia-module-xdoc-1.1.2.jar [ERROR] urls[14] = file:/home/kama/.m2/repository/org/apache/maven/doxia/doxia-core/1.1.2/doxia-core-1.1.2.jar [ERROR] urls[15] = file:/home/kama/.m2/repository/xerces/xercesImpl/2.8.1/xercesImpl-2.8.1.jar [ERROR] urls[16] = file:/home/kama/.m2/repository/commons-lang/commons-lang/2.4/commons-lang-2.4.jar [ERROR] urls[17] = file:/home/kama/.m2/repository/commons-httpclient/commons-httpclient/3.1/commons-httpclient-3.1.jar [ERROR] urls[18] = file:/home/kama/.m2/repository/commons-codec/commons-codec/1.2/commons-codec-1.2.jar [ERROR] urls[19] = file:/home/kama/.m2/repository/org/apache/maven/doxia/doxia-doc-renderer/1.1.2/doxia-doc-renderer-1.1.2.jar [ERROR] urls[20] = file:/home/kama/.m2/repository/org/apache/maven/doxia/doxia-module-itext/1.1.2/doxia-module-itext-1.1.2.jar [ERROR] urls[21] = file:/home/kama/.m2/repository/org/apache/maven/doxia/doxia-module-fo/1.1.2/doxia-module-fo-1.1.2.jar [ERROR] urls[22] = file:/home/kama/.m2/repository/commons-configuration/commons-configuration/1.6/commons-configuration-1.6.jar [ERROR] urls[23] = file:/home/kama/.m2/repository/commons-beanutils/commons-beanutils-core/1.8.0/commons-beanutils-core-1.8.0.jar [ERROR] urls[24] = file:/home/kama/.m2/repository/org/apache/xmlgraphics/fop/0.95/fop-0.95.jar [ERROR] urls[25] = file:/home/kama/.m2/repository/org/apache/xmlgraphics/xmlgraphics-commons/1.3.1/xmlgraphics-commons-1.3.1.jar [ERROR] urls[26] = file:/home/kama/.m2/repository/org/apache/xmlgraphics/batik-svg-dom/1.7/batik-svg-dom-1.7.jar [ERROR] urls[27] = file:/home/kama/.m2/repository/org/apache/xmlgraphics/batik-anim/1.7/batik-anim-1.7.jar [ERROR] urls[28] = file:/home/kama/.m2/repository/org/apache/xmlgraphics/batik-css/1.7/batik-css-1.7.jar [ERROR] urls[29] = file:/home/kama/.m2/repository/org/apache/xmlgraphics/batik-dom/1.7/batik-dom-1.7.jar [ERROR] urls[30] = file:/home/kama/.m2/repository/org/apache/xmlgraphics/batik-parser/1.7/batik-parser-1.7.jar [ERROR] urls[31] = file:/home/kama/.m2/repository/org/apache/xmlgraphics/batik-util/1.7/batik-util-1.7.jar [ERROR] urls[32] = file:/home/kama/.m2/repository/xml-apis/xml-apis-ext/1.3.04/xml-apis-ext-1.3.04.jar [ERROR] urls[33] = file:/home/kama/.m2/repository/org/apache/xmlgraphics/batik-bridge/1.7/batik-bridge-1.7.jar [ERROR] urls[34] = file:/home/kama/.m2/repository/org/apache/xmlgraphics/batik-script/1.7/batik-script-1.7.jar [ERROR] urls[35] = file:/home/kama/.m2/repository/org/apache/xmlgraphics/batik-js/1.7/batik-js-1.7.jar [ERROR] urls[36] = file:/home/kama/.m2/repository/org/apache/xmlgraphics/batik-xml/1.7/batik-xml-1.7.jar [ERROR] urls[37] = file:/home/kama/.m2/repository/org/apache/xmlgraphics/batik-awt-util/1.7/batik-awt-util-1.7.jar [ERROR] urls[38] = file:/home/kama/.m2/repository/org/apache/xmlgraphics/batik-gvt/1.7/batik-gvt-1.7.jar [ERROR] urls[39] = file:/home/kama/.m2/repository/org/apache/xmlgraphics/batik-transcoder/1.7/batik-transcoder-1.7.jar [ERROR] urls[40] = file:/home/kama/.m2/repository/org/apache/xmlgraphics/batik-svggen/1.7/batik-svggen-1.7.jar [ERROR] urls[41] = file:/home/kama/.m2/repository/org/apache/xmlgraphics/batik-extension/1.7/batik-extension-1.7.jar [ERROR] urls[42] = file:/home/kama/.m2/repository/org/apache/xmlgraphics/batik-ext/1.7/batik-ext-1.7.jar [ERROR] urls[43] = file:/home/kama/.m2/repository/org/apache/avalon/framework/avalon-framework-api/4.3.1/avalon-framework-api-4.3.1.jar [ERROR] urls[44] = file:/home/kama/.m2/repository/log4j/log4j/1.2.12/log4j-1.2.12.jar [ERROR] urls[45] = file:/home/kama/.m2/repository/org/apache/maven/doxia/doxia-module-apt/1.1.2/doxia-module-apt-1.1.2.jar [ERROR] urls[46] = file:/home/kama/.m2/repository/org/apache/maven/doxia/doxia-module-fml/1.1.2/doxia-module-fml-1.1.2.jar [ERROR] urls[47] = file:/home/kama/.m2/repository/org/apache/maven/doxia/doxia-module-xhtml/1.1.2/doxia-module-xhtml-1.1.2.jar [ERROR] urls[48] = file:/home/kama/.m2/repository/org/codehaus/plexus/plexus-velocity/1.1.7/plexus-velocity-1.1.7.jar [ERROR] urls[49] = file:/home/kama/.m2/repository/org/apache/velocity/velocity/1.6.2/velocity-1.6.2.jar [ERROR] urls[50] = file:/home/kama/.m2/repository/commons-collections/commons-collections/3.2.1/commons-collections-3.2.1.jar [ERROR] urls[51] = file:/home/kama/.m2/repository/com/lowagie/itext/1.4/itext-1.4.jar [ERROR] urls[52] = file:/home/kama/.m2/repository/xalan/xalan/2.7.0/xalan-2.7.0.jar [ERROR] urls[53] = file:/home/kama/.m2/repository/xml-apis/xml-apis/1.3.04/xml-apis-1.3.04.jar [ERROR] urls[54] = file:/home/kama/.m2/repository/org/apache/maven/doxia/doxia-decoration-model/1.1.2/doxia-decoration-model-1.1.2.jar [ERROR] urls[55] = file:/home/kama/.m2/repository/org/apache/maven/doxia/doxia-site-renderer/1.1.2/doxia-site-renderer-1.1.2.jar [ERROR] urls[56] = file:/home/kama/.m2/repository/org/codehaus/plexus/plexus-utils/1.5.7/plexus-utils-1.5.7.jar [ERROR] urls[57] = file:/home/kama/.m2/repository/org/codehaus/plexus/plexus-interpolation/1.7/plexus-interpolation-1.7.jar [ERROR] urls[58] = file:/home/kama/.m2/repository/org/codehaus/plexus/plexus-i18n/1.0-beta-7/plexus-i18n-1.0-beta-7.jar [ERROR] urls[59] = file:/home/kama/.m2/repository/junit/junit/3.8.1/junit-3.8.1.jar [ERROR] urls[60] = file:/home/kama/.m2/repository/commons-logging/commons-logging/1.1.1/commons-logging-1.1.1.jar [ERROR] Number of foreign imports: 1 [ERROR] import : Entry[ import from realm ClassRealm[project>com.soebes.maven.guide:maui:0.1-SNAPSHOT, parent: ClassRealm[maven.api, parent: null ]]] [ERROR] [ERROR] ----------------------------------------------------- [ERROR] -> [Help 1] [ERROR] [ERROR] To see the full stack trace of the errors, re-run Maven with the -e switch . [ERROR] Re-run Maven using the -X switch to enable full debug logging. [ERROR] [ERROR] For more information about the errors and possible solutions, please read the following articles: [ERROR] [Help 1] http: //cwiki.apache.org/confluence/display/MAVEN/PluginContainerException kama@office:~/ws-git/maui$ The full project can be found here: https://github.com/khmarbaise/maui I used the pom snippet from the project web-site ( http://maven.apache.org/plugins/maven-pdf-plugin/usage.html )
          Hide
          Karl-Heinz Marbaise added a comment -

          I've rechecked the plugin and found out that it works fine with Maven 2.2.1 (Ok...some of the layout parts can be dicussed, but that's different story). So overall the problem seemed to be caused by running it with Maven 3.0.3 instead of Maven 2.2.1.

          Show
          Karl-Heinz Marbaise added a comment - I've rechecked the plugin and found out that it works fine with Maven 2.2.1 (Ok...some of the layout parts can be dicussed, but that's different story). So overall the problem seemed to be caused by running it with Maven 3.0.3 instead of Maven 2.2.1.
          Hide
          Lukas Theussl added a comment -

          Did you try with latest snapshot? See MPDF-41.

          Show
          Lukas Theussl added a comment - Did you try with latest snapshot? See MPDF-41 .
          Hide
          Karl-Heinz Marbaise added a comment -

          I checked with Maven 3.0.3 the trunk https://svn.apache.org/repos/asf/maven/plugins/trunk/maven-pdf-plugin/ (r1129830) and the result looks good:

          [INFO] 
          [INFO] --- maven-pdf-plugin:1.2-SNAPSHOT:pdf (pdf) @ maui ---
          [INFO] Ignoring api call removed in maven 3, no reports are generated!
          [INFO] Ignoring api call removed in maven 3, no reports are generated!
          [INFO] ------------------------------------------------------------------------
          [INFO] BUILD SUCCESS
          [INFO] ------------------------------------------------------------------------
          [INFO] Total time: 24.658s
          [INFO] Finished at: Tue May 31 20:06:53 CEST 2011
          [INFO] Final Memory: 25M/311M
          [INFO] ------------------------------------------------------------------------
          

          Also a PDF is generated which looks good except that the Project Reports (Changes Report) is missing in this PDF....

          The result for Maven 2.2.1 looks like this:

          [INFO] Scanning for projects...
          [INFO] ------------------------------------------------------------------------
          [INFO] Building MaUI Test Guide
          [INFO]    task-segment: [clean, site]
          [INFO] ------------------------------------------------------------------------
          [INFO] [clean:clean {execution: default-clean}]
          [INFO] Deleting directory /home/kama/ws-git/maui/target
          [INFO] [assembly:single {execution: make-assembly}]
          [INFO] Reading assembly descriptor: /home/kama/ws-git/maui/src.xml
          [INFO] Building zip: /home/kama/ws-git/maui/target/maui-0.1-SNAPSHOT-src.zip
          [INFO] Building tar : /home/kama/ws-git/maui/target/maui-0.1-SNAPSHOT-src.tar.gz
          [INFO] Building tar : /home/kama/ws-git/maui/target/maui-0.1-SNAPSHOT-src.tar.bz2
          [INFO] [doxia:render-books {execution: gernate-latex}]
          [INFO] [site:site {execution: default-site}]
          [INFO] Skipped "About" report, file "index.html" already exists for the English version.
          [INFO] Generating "Changes Report" report.
          [INFO] Generating "Plugin Management" report.
          [INFO] Generating "Mailing Lists" report.
          [INFO] Generating "Continuous Integration" report.
          [INFO] Generating "Project License" report.
          [INFO] Generating "Project Team" report.
          [INFO] Generating "Source Repository" report.
          [INFO] Generating "Issue Tracking" report.
          [INFO] Generating "Project Summary" report.
          [INFO] Generating "Project Plugins" report.
          [INFO] Generating "Dependencies" report.
          [INFO] [pdf:pdf {execution: pdf}]
          [INFO] Generating "Changes Report" report.
          ERROR [org.apache.fop.fo.FONode:83] 2011-05-31 20:12:13,564 - Image not found: images/update.gif
          [INFO] ------------------------------------------------------------------------
          [INFO] BUILD SUCCESSFUL
          [INFO] ------------------------------------------------------------------------
          [INFO] Total time: 26 seconds
          [INFO] Finished at: Tue May 31 20:12:13 CEST 2011
          [INFO] Final Memory: 64M/353M
          [INFO] ------------------------------------------------------------------------
          
          Show
          Karl-Heinz Marbaise added a comment - I checked with Maven 3.0.3 the trunk https://svn.apache.org/repos/asf/maven/plugins/trunk/maven-pdf-plugin/ (r1129830) and the result looks good: [INFO] [INFO] --- maven-pdf-plugin:1.2-SNAPSHOT:pdf (pdf) @ maui --- [INFO] Ignoring api call removed in maven 3, no reports are generated! [INFO] Ignoring api call removed in maven 3, no reports are generated! [INFO] ------------------------------------------------------------------------ [INFO] BUILD SUCCESS [INFO] ------------------------------------------------------------------------ [INFO] Total time: 24.658s [INFO] Finished at: Tue May 31 20:06:53 CEST 2011 [INFO] Final Memory: 25M/311M [INFO] ------------------------------------------------------------------------ Also a PDF is generated which looks good except that the Project Reports (Changes Report) is missing in this PDF.... The result for Maven 2.2.1 looks like this: [INFO] Scanning for projects... [INFO] ------------------------------------------------------------------------ [INFO] Building MaUI Test Guide [INFO] task-segment: [clean, site] [INFO] ------------------------------------------------------------------------ [INFO] [clean:clean {execution: default -clean}] [INFO] Deleting directory /home/kama/ws-git/maui/target [INFO] [assembly:single {execution: make-assembly}] [INFO] Reading assembly descriptor: /home/kama/ws-git/maui/src.xml [INFO] Building zip: /home/kama/ws-git/maui/target/maui-0.1-SNAPSHOT-src.zip [INFO] Building tar : /home/kama/ws-git/maui/target/maui-0.1-SNAPSHOT-src.tar.gz [INFO] Building tar : /home/kama/ws-git/maui/target/maui-0.1-SNAPSHOT-src.tar.bz2 [INFO] [doxia:render-books {execution: gernate-latex}] [INFO] [site:site {execution: default -site}] [INFO] Skipped "About" report, file "index.html" already exists for the English version. [INFO] Generating "Changes Report" report. [INFO] Generating "Plugin Management" report. [INFO] Generating "Mailing Lists" report. [INFO] Generating "Continuous Integration" report. [INFO] Generating "Project License" report. [INFO] Generating "Project Team" report. [INFO] Generating "Source Repository" report. [INFO] Generating "Issue Tracking" report. [INFO] Generating "Project Summary" report. [INFO] Generating "Project Plugins" report. [INFO] Generating "Dependencies" report. [INFO] [pdf:pdf {execution: pdf}] [INFO] Generating "Changes Report" report. ERROR [org.apache.fop.fo.FONode:83] 2011-05-31 20:12:13,564 - Image not found: images/update.gif [INFO] ------------------------------------------------------------------------ [INFO] BUILD SUCCESSFUL [INFO] ------------------------------------------------------------------------ [INFO] Total time: 26 seconds [INFO] Finished at: Tue May 31 20:12:13 CEST 2011 [INFO] Final Memory: 64M/353M [INFO] ------------------------------------------------------------------------
          Lukas Theussl made changes -
          Field Original Value New Value
          Link This issue duplicates MPDF-41 [ MPDF-41 ]
          Lukas Theussl made changes -
          Status Open [ 1 ] Closed [ 6 ]
          Assignee Lukas Theussl [ lukas ]
          Resolution Duplicate [ 3 ]
          Hide
          Dan Rollo added a comment -

          It seems v1.2 of the plugin will now work with maven3.0.3. Any ETA on a release of v1.2 of pdf plugin?

          Show
          Dan Rollo added a comment - It seems v1.2 of the plugin will now work with maven3.0.3. Any ETA on a release of v1.2 of pdf plugin?

            People

            • Assignee:
              Lukas Theussl
              Reporter:
              Karl-Heinz Marbaise
            • Votes:
              0 Vote for this issue
              Watchers:
              0 Start watching this issue

              Dates

              • Created:
                Updated:
                Resolved: